{"text_format":"1","workbook":"xlsx","n_sheets":8,"sheets":["Deckblatt","Turnierprotokoll","Einzelwertung","Kategoriewertung","Mannschaften","Startliste","Konstanten","players"],"not_rendered":{"charts":0,"images":1,"macros":1,"external_links":0,"defined_names":26,"comments":0,"pivot_tables":0},"unopened":[],"bounds":{"document_bytes":16777216,"sheet_cells":100000,"rows_first":2000,"rows_last":500,"rows_between":2000,"halvings":0,"cell_chars":16384,"cell_head_chars":4096},"cells_cut":0,"cells_raw":0,"read":"whole","date_system":"1900"}

{"sheet":"Deckblatt","index":0,"n_rows":69,"n_cols":16,"rows_kept":69,"cut":false,"hidden":false,"merged":[[55,5,55,10],[56,5,56,10],[55,2,55,4],[56,2,56,4],[52,0,52,1],[55,0,55,1],[56,0,56,1],[57,0,57,1],[58,0,58,1],[44,0,44,1],[45,0,45,1],[46,0,46,1],[47,0,47,1],[50,0,50,1],[0,0,0,13],[1,0,1,13],[2,0,2,13],[3,0,3,13],[5,3,5,5],[5,6,5,9],[5,12,5,13],[5,10,5,11],[4,10,4,11],[4,12,4,13],[7,3,7,5],[7,6,7,9],[7,12,7,13],[8,3,8,5],[8,6,8,9],[8,12,8,13],[7,10,7,11],[8,10,8,11],[9,3,9,5],[9,6,9,9],[9,12,9,13],[12,0,12,13],[13,0,13,13],[9,10,9,11],[47,5,47,10],[43,5,43,10],[44,2,44,4],[44,5,44,10],[45,2,45,4],[45,5,45,10],[7,15,7,17],[67,0,67,3],[50,2,50,4],[50,5,50,10],[51,5,51,10],[52,2,52,4],[52,5,52,10],[49,5,49,10],[64,0,64,3],[46,2,46,4],[46,5,46,10],[47,2,47,4]]}
[{"$f":"IF(Ligawahl<10,\"Minigolfsport-Verband Bremen/Niedersachsen e.V.\",\"Deutscher Minigolfsport Verband e. V.\")","v":"Minigolfsport-Verband Bremen/Niedersachsen e.V."}]
["Ergebnisliste"]
[{"$f":"Spieltagwahl&\". Spieltag  -  \"&VLOOKUP(Ligawahl,Teamgröße,2,0)&\"  -  Saison 2019\"","v":"3. Spieltag  -  Landesliga Nord  -  Saison 2019"}]
[{"$f":"\"am \"&TEXT(P7,\"TT.MM.JJJJ\")&\" in \"&P8","v":"am 05.05.2019 in Cuxhaven"}]
[null,null,null,"Name, Vorname",null,null,"Verein",null,null,null,"Spieler-Nr.",null,"Lizenz-Nr."]
["A. Turnierleitung:",null,null,{"$f":"IF(K6=\"\",\"\",IF(ISERROR(VLOOKUP(K6,Spieler,4,0)),\"Falsche Nummer!\",VLOOKUP(K6,Spieler,4,0)&\", \"&VLOOKUP(K6,Spieler,3,0)))","v":"Reinicke, Frank"},null,null,{"$f":"IF(ISERROR(VLOOKUP(K6,Spieler,5,0)),\"\",VLOOKUP(K6,Spieler,5,0))","v":"MC Möve Cuxhaven"},null,null,null,42691,null,{"$f":"IF(ISERROR(VLOOKUP(K6,Spieler,7,0)),\"\",VLOOKUP(K6,Spieler,7,0))","v":"17597"}]
[null,null,null,null,null,null,null,null,null,null,null,null,null,null,"Datum:","2019-05-05"]
["B. Schiedsgericht:",null,"OSR:",{"$f":"IF(K8=\"\",\"\",IF(ISERROR(VLOOKUP(K8,Spieler,4,0)),\"Falsche Nummer!\",VLOOKUP(K8,Spieler,4,0)&\", \"&VLOOKUP(K8,Spieler,3,0)))","v":"Krause, Dirk"},null,null,{"$f":"IF(ISERROR(VLOOKUP(K8,Spieler,5,0)),\"\",VLOOKUP(K8,Spieler,5,0))","v":"BGC Celle"},null,null,null,48931,null,{"$f":"IF(ISERROR(VLOOKUP(K8,Spieler,7,0)),\"\",VLOOKUP(K8,Spieler,7,0))","v":"20839"},null,"Ort:","Cuxhaven"]
[null,null,"SR:",{"$f":"IF(K9=\"\",\"\",IF(ISERROR(VLOOKUP(K9,Spieler,4,0)),\"Falsche Nummer!\",VLOOKUP(K9,Spieler,4,0)&\", \"&VLOOKUP(K9,Spieler,3,0)))","v":"Hunte, Stefanie"},null,null,{"$f":"IF(ISERROR(VLOOKUP(K9,Spieler,5,0)),\"\",VLOOKUP(K9,Spieler,5,0))","v":"BGC Diepholz"},null,null,null,40603,null,{"$f":"IF(ISERROR(VLOOKUP(K9,Spieler,7,0)),\"\",VLOOKUP(K9,Spieler,7,0))","v":"16468"},null,"System:","Miniaturgolf"]
[null,null,"SR:",{"$f":"IF(K10=\"\",\"\",IF(ISERROR(VLOOKUP(K10,Spieler,4,0)),\"Falsche Nummer!\",VLOOKUP(K10,Spieler,4,0)&\", \"&VLOOKUP(K10,Spieler,3,0)))","v":"Weigang, Klaus-Dieter"},null,null,{"$f":"IF(ISERROR(VLOOKUP(K10,Spieler,5,0)),\"\",VLOOKUP(K10,Spieler,5,0))","v":"BGC Hannover"},null,null,null,6605,null,{"$f":"IF(ISERROR(VLOOKUP(K10,Spieler,7,0)),\"\",VLOOKUP(K10,Spieler,7,0))","v":"5025"}]
[]
["C. Besondere Vorkommnisse:"]
["keine"]
[]
[]
["D. Mannschaftswertung vor dem Spieltag:",null,null,null,null,null,null,null,null,null,null,null,null,null,6]
[null,null,null,null,null,null,"Diep","Celle","Cux","Ort4","Ort5","Ges.","ø","Punkte",5]
[null,null,null,null,null,"gespielte Runden:",4,4]
[1,"1. BGC Celle I",null,null,null,null,379,347,null,null,null,{"$f":"SUM(G19:K19)","v":726},{"$f":"IF(L19<>0,L19/(SUM($G$18:$K$18)*(AnzSp-2)),0)","v":22.6875},16]
[{"$f":"A19+1","v":2},"MC \"Möve\" Cuxhaven III",null,null,null,null,423,401,null,null,null,{"$f":"SUM(G20:K20)","v":824},{"$f":"IF(L20<>0,L20/(SUM($G$18:$K$18)*(AnzSp-2)),0)","v":25.75},8]
[{"$f":"A20+1","v":3},"BGC Diepholz II",null,null,null,null,427,390,null,null,null,{"$f":"SUM(G21:K21)","v":817},{"$f":"IF(L21<>0,L21/(SUM($G$18:$K$18)*(AnzSp-2)),0)","v":25.53125},7]
[{"$f":"A21+1","v":4},"1. BGC Hannover III",null,null,null,null,462,288,null,null,null,{"$f":"SUM(G22:K22)","v":750},{"$f":"IF(L22<>0,L22/(SUM($G$18:$K$18)*(AnzSp-2)),0)","v":23.4375},6]
[{"$f":"A22+1","v":5},"VfL Lüneburg I",null,null,null,null,427,427,null,null,null,{"$f":"SUM(G23:K23)","v":854},{"$f":"IF(L23<>0,L23/(SUM($G$18:$K$18)*(AnzSp-2)),0)","v":26.6875},3]
[]
["E. Mannschaftswertung des Spieltages:"]
[null,null,null,null,null,null,null,"R1","R2","R3","R4","Ges.","ø","Punkte"]
[1,{"$f":"IF(INDIRECT(\"Mannschaften!Z\"&A27*(AnzSp+4)-AnzSp&\"S\"&COLUMN(),0)=\"\",\"\",INDIRECT(\"Mannschaften!Z\"&A27*(AnzSp+4)-AnzSp&\"S\"&COLUMN(),0))","v":"1. BGC Celle I"},null,null,null,null,null,{"$f":"IF(INDIRECT(\"Mannschaften!Z\"&$A27*(AnzSp+4)+2&\"S\"&COLUMN()-1,0)=0,\"\",INDIRECT(\"Mannschaften!Z\"&$A27*(AnzSp+4)+2&\"S\"&COLUMN()-1,0))","v":106},92,93,97,{"$f":"SUM(H27:K27)","v":388},{"$f":"IF(L27<>0,L27/(COUNT(H27:K27)*(AnzSp-2)),0)","v":24.25},8]
[{"$f":"A27+1","v":2},{"$f":"IF(INDIRECT(\"Mannschaften!Z\"&A28*(AnzSp+4)-AnzSp&\"S\"&COLUMN(),0)=\"\",\"\",INDIRECT(\"Mannschaften!Z\"&A28*(AnzSp+4)-AnzSp&\"S\"&COLUMN(),0))","v":"1. BGC Hannover III"},null,null,null,null,null,106,102,100,101,{"$f":"SUM(H28:K28)","v":409},{"$f":"IF(L28<>0,L28/(COUNT(H28:K28)*(AnzSp-2)),0)","v":25.5625},6]
[{"$f":"A28+1","v":3},{"$f":"IF(INDIRECT(\"Mannschaften!Z\"&A29*(AnzSp+4)-AnzSp&\"S\"&COLUMN(),0)=\"\",\"\",INDIRECT(\"Mannschaften!Z\"&A29*(AnzSp+4)-AnzSp&\"S\"&COLUMN(),0))","v":"VfL Lüneburg I"},null,null,null,null,null,102,101,104,112,{"$f":"SUM(H29:K29)","v":419},{"$f":"IF(L29<>0,L29/(COUNT(H29:K29)*(AnzSp-2)),0)","v":26.1875},4]
[{"$f":"A29+1","v":4},{"$f":"IF(INDIRECT(\"Mannschaften!Z\"&A30*(AnzSp+4)-AnzSp&\"S\"&COLUMN(),0)=\"\",\"\",INDIRECT(\"Mannschaften!Z\"&A30*(AnzSp+4)-AnzSp&\"S\"&COLUMN(),0))","v":"MC \"Möve\" Cuxhaven III"},null,null,null,null,null,111,105,102,105,{"$f":"SUM(H30:K30)","v":423},{"$f":"IF(L30<>0,L30/(COUNT(H30:K30)*(AnzSp-2)),0)","v":26.4375},2]
[{"$f":"A30+1","v":5},{"$f":"IF(INDIRECT(\"Mannschaften!Z\"&A31*(AnzSp+4)-AnzSp&\"S\"&COLUMN(),0)=\"\",\"\",INDIRECT(\"Mannschaften!Z\"&A31*(AnzSp+4)-AnzSp&\"S\"&COLUMN(),0))","v":"BGC Diepholz II"},null,null,null,null,null,114,105,107,113,{"$f":"SUM(H31:K31)","v":439},{"$f":"IF(L31<>0,L31/(COUNT(H31:K31)*(AnzSp-2)),0)","v":27.4375},0]
[]
["F. Mannschaftswertung nach dem Spieltag:"]
[null,null,null,null,null,null,{"$f":"G17","v":"Diep"},{"$f":"H17","v":"Celle"},{"$f":"I17","v":"Cux"},{"$f":"J17","v":"Ort4"},{"$f":"K17","v":"Ort5"},"Ges.","ø","Punkte"]
[null,null,null,null,null,"gespielte Runden:",{"$f":"IF(G19<>\"\",G18,IF(AnzahlRd>0,AnzahlRd,\"\"))","v":4},{"$f":"IF(H19<>\"\",H18,IF(G19<>\"\",AnzahlRd,\"\"))","v":4},{"$f":"IF(I19<>\"\",I18,IF(H19<>\"\",AnzahlRd,\"\"))","v":4},{"$f":"IF(J19<>\"\",J18,IF(I19<>\"\",AnzahlRd,\"\"))","v":""},{"$f":"IF(K19<>\"\",K18,IF(J19<>\"\",AnzahlRd,\"\"))","v":""}]
[1,"1. BGC Celle I",null,null,null,null,{"$f":"IF(ISERROR(VLOOKUP($B36,Teams,COLUMN()-1,0)),\"\",IF(AND(VLOOKUP($B36,Teams,COLUMN()-1,0)=\"\",OR(VLOOKUP($B36,Teams,COLUMN()-2,0)<>\"\",F$34=\"\")),VLOOKUP($B36,Teams2,11,0),VLOOKUP($B36,Teams,COLUMN()-1,0)))","v":379},{"$f":"IF(ISERROR(VLOOKUP($B36,Teams,COLUMN()-1,0)),\"\",IF(AND(VLOOKUP($B36,Teams,COLUMN()-1,0)=\"\",OR(VLOOKUP($B36,Teams,COLUMN()-2,0)<>\"\",G$34=\"\")),VLOOKUP($B36,Teams2,11,0),VLOOKUP($B36,Teams,COLUMN()-1,0)))","v":347},{"$f":"IF(ISERROR(VLOOKUP($B36,Teams,COLUMN()-1,0)),\"\",IF(AND(VLOOKUP($B36,Teams,COLUMN()-1,0)=\"\",OR(VLOOKUP($B36,Teams,COLUMN()-2,0)<>\"\",H$34=\"\")),VLOOKUP($B36,Teams2,11,0),VLOOKUP($B36,Teams,COLUMN()-1,0)))","v":388},{"$f":"IF(ISERROR(VLOOKUP($B36,Teams,COLUMN()-1,0)),\"\",IF(AND(VLOOKUP($B36,Teams,COLUMN()-1,0)=\"\",OR(VLOOKUP($B36,Teams,COLUMN()-2,0)<>\"\",I$34=\"\")),VLOOKUP($B36,Teams2,11,0),VLOOKUP($B36,Teams,COLUMN()-1,0)))","v":0},{"$f":"IF(ISERROR(VLOOKUP($B36,Teams,COLUMN()-1,0)),\"\",IF(AND(VLOOKUP($B36,Teams,COLUMN()-1,0)=\"\",OR(VLOOKUP($B36,Teams,COLUMN()-2,0)<>\"\",J$34=\"\")),VLOOKUP($B36,Teams2,11,0),VLOOKUP($B36,Teams,COLUMN()-1,0)))","v":0},{"$f":"SUM(G36:K36)","v":1114},{"$f":"IF(L36<>0,L36/(SUM($G$35:$K$35)*(AnzSp-2)),0)","v":23.208333333333332},{"$f":"IF(ISERROR(VLOOKUP(B36,Teams,COLUMN()-1,0)),\"\",VLOOKUP(B36,Teams,13,0)+VLOOKUP(B36,Teams2,13,0))","v":24}]
[{"$f":"A36+1","v":2},"1. BGC Hannover III",null,null,null,null,{"$f":"IF(ISERROR(VLOOKUP($B37,Teams,COLUMN()-1,0)),\"\",IF(AND(VLOOKUP($B37,Teams,COLUMN()-1,0)=\"\",OR(VLOOKUP($B37,Teams,COLUMN()-2,0)<>\"\",F$34=\"\")),VLOOKUP($B37,Teams2,11,0),VLOOKUP($B37,Teams,COLUMN()-1,0)))","v":462},{"$f":"IF(ISERROR(VLOOKUP($B37,Teams,COLUMN()-1,0)),\"\",IF(AND(VLOOKUP($B37,Teams,COLUMN()-1,0)=\"\",OR(VLOOKUP($B37,Teams,COLUMN()-2,0)<>\"\",G$34=\"\")),VLOOKUP($B37,Teams2,11,0),VLOOKUP($B37,Teams,COLUMN()-1,0)))","v":288},{"$f":"IF(ISERROR(VLOOKUP($B37,Teams,COLUMN()-1,0)),\"\",IF(AND(VLOOKUP($B37,Teams,COLUMN()-1,0)=\"\",OR(VLOOKUP($B37,Teams,COLUMN()-2,0)<>\"\",H$34=\"\")),VLOOKUP($B37,Teams2,11,0),VLOOKUP($B37,Teams,COLUMN()-1,0)))","v":409},{"$f":"IF(ISERROR(VLOOKUP($B37,Teams,COLUMN()-1,0)),\"\",IF(AND(VLOOKUP($B37,Teams,COLUMN()-1,0)=\"\",OR(VLOOKUP($B37,Teams,COLUMN()-2,0)<>\"\",I$34=\"\")),VLOOKUP($B37,Teams2,11,0),VLOOKUP($B37,Teams,COLUMN()-1,0)))","v":0},{"$f":"IF(ISERROR(VLOOKUP($B37,Teams,COLUMN()-1,0)),\"\",IF(AND(VLOOKUP($B37,Teams,COLUMN()-1,0)=\"\",OR(VLOOKUP($B37,Teams,COLUMN()-2,0)<>\"\",J$34=\"\")),VLOOKUP($B37,Teams2,11,0),VLOOKUP($B37,Teams,COLUMN()-1,0)))","v":0},{"$f":"SUM(G37:K37)","v":1159},{"$f":"IF(L37<>0,L37/(SUM($G$35:$K$35)*(AnzSp-2)),0)","v":24.145833333333332},{"$f":"IF(ISERROR(VLOOKUP(B37,Teams,COLUMN()-1,0)),\"\",VLOOKUP(B37,Teams,13,0)+VLOOKUP(B37,Teams2,13,0))","v":12}]
[{"$f":"A37+1","v":3},"MC \"Möve\" Cuxhaven III",null,null,null,null,{"$f":"IF(ISERROR(VLOOKUP($B38,Teams,COLUMN()-1,0)),\"\",IF(AND(VLOOKUP($B38,Teams,COLUMN()-1,0)=\"\",OR(VLOOKUP($B38,Teams,COLUMN()-2,0)<>\"\",F$34=\"\")),VLOOKUP($B38,Teams2,11,0),VLOOKUP($B38,Teams,COLUMN()-1,0)))","v":423},{"$f":"IF(ISERROR(VLOOKUP($B38,Teams,COLUMN()-1,0)),\"\",IF(AND(VLOOKUP($B38,Teams,COLUMN()-1,0)=\"\",OR(VLOOKUP($B38,Teams,COLUMN()-2,0)<>\"\",G$34=\"\")),VLOOKUP($B38,Teams2,11,0),VLOOKUP($B38,Teams,COLUMN()-1,0)))","v":401},{"$f":"IF(ISERROR(VLOOKUP($B38,Teams,COLUMN()-1,0)),\"\",IF(AND(VLOOKUP($B38,Teams,COLUMN()-1,0)=\"\",OR(VLOOKUP($B38,Teams,COLUMN()-2,0)<>\"\",H$34=\"\")),VLOOKUP($B38,Teams2,11,0),VLOOKUP($B38,Teams,COLUMN()-1,0)))","v":423},{"$f":"IF(ISERROR(VLOOKUP($B38,Teams,COLUMN()-1,0)),\"\",IF(AND(VLOOKUP($B38,Teams,COLUMN()-1,0)=\"\",OR(VLOOKUP($B38,Teams,COLUMN()-2,0)<>\"\",I$34=\"\")),VLOOKUP($B38,Teams2,11,0),VLOOKUP($B38,Teams,COLUMN()-1,0)))","v":0},{"$f":"IF(ISERROR(VLOOKUP($B38,Teams,COLUMN()-1,0)),\"\",IF(AND(VLOOKUP($B38,Teams,COLUMN()-1,0)=\"\",OR(VLOOKUP($B38,Teams,COLUMN()-2,0)<>\"\",J$34=\"\")),VLOOKUP($B38,Teams2,11,0),VLOOKUP($B38,Teams,COLUMN()-1,0)))","v":0},{"$f":"SUM(G38:K38)","v":1247},{"$f":"IF(L38<>0,L38/(SUM($G$35:$K$35)*(AnzSp-2)),0)","v":25.979166666666668},{"$f":"IF(ISERROR(VLOOKUP(B38,Teams,COLUMN()-1,0)),\"\",VLOOKUP(B38,Teams,13,0)+VLOOKUP(B38,Teams2,13,0))","v":10}]
[{"$f":"A38+1","v":4},"BGC Diepholz II",null,null,null,null,{"$f":"IF(ISERROR(VLOOKUP($B39,Teams,COLUMN()-1,0)),\"\",IF(AND(VLOOKUP($B39,Teams,COLUMN()-1,0)=\"\",OR(VLOOKUP($B39,Teams,COLUMN()-2,0)<>\"\",F$34=\"\")),VLOOKUP($B39,Teams2,11,0),VLOOKUP($B39,Teams,COLUMN()-1,0)))","v":427},{"$f":"IF(ISERROR(VLOOKUP($B39,Teams,COLUMN()-1,0)),\"\",IF(AND(VLOOKUP($B39,Teams,COLUMN()-1,0)=\"\",OR(VLOOKUP($B39,Teams,COLUMN()-2,0)<>\"\",G$34=\"\")),VLOOKUP($B39,Teams2,11,0),VLOOKUP($B39,Teams,COLUMN()-1,0)))","v":390},{"$f":"IF(ISERROR(VLOOKUP($B39,Teams,COLUMN()-1,0)),\"\",IF(AND(VLOOKUP($B39,Teams,COLUMN()-1,0)=\"\",OR(VLOOKUP($B39,Teams,COLUMN()-2,0)<>\"\",H$34=\"\")),VLOOKUP($B39,Teams2,11,0),VLOOKUP($B39,Teams,COLUMN()-1,0)))","v":439},{"$f":"IF(ISERROR(VLOOKUP($B39,Teams,COLUMN()-1,0)),\"\",IF(AND(VLOOKUP($B39,Teams,COLUMN()-1,0)=\"\",OR(VLOOKUP($B39,Teams,COLUMN()-2,0)<>\"\",I$34=\"\")),VLOOKUP($B39,Teams2,11,0),VLOOKUP($B39,Teams,COLUMN()-1,0)))","v":0},{"$f":"IF(ISERROR(VLOOKUP($B39,Teams,COLUMN()-1,0)),\"\",IF(AND(VLOOKUP($B39,Teams,COLUMN()-1,0)=\"\",OR(VLOOKUP($B39,Teams,COLUMN()-2,0)<>\"\",J$34=\"\")),VLOOKUP($B39,Teams2,11,0),VLOOKUP($B39,Teams,COLUMN()-1,0)))","v":0},{"$f":"SUM(G39:K39)","v":1256},{"$f":"IF(L39<>0,L39/(SUM($G$35:$K$35)*(AnzSp-2)),0)","v":26.166666666666668},{"$f":"IF(ISERROR(VLOOKUP(B39,Teams,COLUMN()-1,0)),\"\",VLOOKUP(B39,Teams,13,0)+VLOOKUP(B39,Teams2,13,0))","v":7}]
[{"$f":"A39+1","v":5},"VfL Lüneburg I",null,null,null,null,{"$f":"IF(ISERROR(VLOOKUP($B40,Teams,COLUMN()-1,0)),\"\",IF(AND(VLOOKUP($B40,Teams,COLUMN()-1,0)=\"\",OR(VLOOKUP($B40,Teams,COLUMN()-2,0)<>\"\",F$34=\"\")),VLOOKUP($B40,Teams2,11,0),VLOOKUP($B40,Teams,COLUMN()-1,0)))","v":427},{"$f":"IF(ISERROR(VLOOKUP($B40,Teams,COLUMN()-1,0)),\"\",IF(AND(VLOOKUP($B40,Teams,COLUMN()-1,0)=\"\",OR(VLOOKUP($B40,Teams,COLUMN()-2,0)<>\"\",G$34=\"\")),VLOOKUP($B40,Teams2,11,0),VLOOKUP($B40,Teams,COLUMN()-1,0)))","v":427},{"$f":"IF(ISERROR(VLOOKUP($B40,Teams,COLUMN()-1,0)),\"\",IF(AND(VLOOKUP($B40,Teams,COLUMN()-1,0)=\"\",OR(VLOOKUP($B40,Teams,COLUMN()-2,0)<>\"\",H$34=\"\")),VLOOKUP($B40,Teams2,11,0),VLOOKUP($B40,Teams,COLUMN()-1,0)))","v":419},{"$f":"IF(ISERROR(VLOOKUP($B40,Teams,COLUMN()-1,0)),\"\",IF(AND(VLOOKUP($B40,Teams,COLUMN()-1,0)=\"\",OR(VLOOKUP($B40,Teams,COLUMN()-2,0)<>\"\",I$34=\"\")),VLOOKUP($B40,Teams2,11,0),VLOOKUP($B40,Teams,COLUMN()-1,0)))","v":0},{"$f":"IF(ISERROR(VLOOKUP($B40,Teams,COLUMN()-1,0)),\"\",IF(AND(VLOOKUP($B40,Teams,COLUMN()-1,0)=\"\",OR(VLOOKUP($B40,Teams,COLUMN()-2,0)<>\"\",J$34=\"\")),VLOOKUP($B40,Teams2,11,0),VLOOKUP($B40,Teams,COLUMN()-1,0)))","v":0},{"$f":"SUM(G40:K40)","v":1273},{"$f":"IF(L40<>0,L40/(SUM($G$35:$K$35)*(AnzSp-2)),0)","v":26.520833333333332},{"$f":"IF(ISERROR(VLOOKUP(B40,Teams,COLUMN()-1,0)),\"\",VLOOKUP(B40,Teams,13,0)+VLOOKUP(B40,Teams2,13,0))","v":7}]
[]
["G. Beste Durchgänge:"]
["Kategorie",null,"Name",null,null,"Verein",null,null,null,null,null,"Erg."]
[{"$f":"(AnzSp-2)&\"er-Mannschaften\"","v":"4er-Mannschaften"},null,null,null,null,"1. BGC Celle I",null,null,null,null,null,92]
["Damen:",null,"Lindenberg, Mareike",null,null,"1. BGC Celle I",null,null,null,null,null,24]
["Herren: ",null,"Neumann, Kevin",null,null,"1. BGC Celle I",null,null,null,null,null,21]
["Seniorinnen I:",null,"Ehm, Marion ",null,null,"1. BGC Celle I",null,null,null,null,null,23]
["Senioren I:",null,"Gaute, Wolfgang",null,null,"VfL Lüneburg",null,null,null,null,null,22]
[null,null,"Wendland, Dieter",null,null,"MC \"Möve\" Cuxhaven III",null,null,null,null,null,22]
[null,null,"Krause, Dirk",null,null,"1. BGC Celle I",null,null,null,null,null,22]
["Seniorinnen II:",null,"Weigang, Barbara",null,null,"1. BGC Hannover III",null,null,null,null,null,24]
[null,null,"Jahrmärker, Uta",null,null,"1. BGC Celle I",null,null,null,null,null,24,"2x"]
["Senioren II:",null,"Außerwinkler, Manfred",null,null,"1. BGC Hannover III",null,null,null,null,null,22]
[null,null,"Beier, Christian",null,null,"MC \"Möve\" Cuxhaven III",null,null,null,null,null,22]
[null,null,"Weigang, Klaus-Dieter",null,null,"1. BGC Hannover III",null,null,null,null,null,22]
["Jugend weiblich:",null,"Rotermund, Marie Sophie",null,null,"1. BGC Celle I",null,null,null,null,null,22,"2x"]
["Jugend männlich:",null,"Lange, Kevin",null,null,"BGC Diepholz II",null,null,null,null,null,26]
[]
[]
[]
["H. Zeichenerklärungen:"]
[]
[]
[]
["Cuxhaven, 07.05.2019"]
["Für die Richtigkeit"]
[]
["Susanne Granz "]
["/Pressereferentin)"]

{"sheet":"Turnierprotokoll","index":1,"n_rows":27,"n_cols":7,"rows_kept":27,"cut":false,"hidden":false,"merged":[[20,0,20,2],[20,4,20,6],[22,0,22,6],[24,1,24,5],[26,4,26,6],[18,0,18,2],[18,4,18,6],[1,0,1,6],[3,1,3,6],[4,1,4,6],[5,3,5,6],[6,1,6,6],[9,1,9,4],[11,1,11,4],[12,1,12,4],[13,1,13,4],[16,0,16,2],[16,4,16,6]]}
[]
["Turnierprotokoll"]
[]
["Turnier:",{"$f":"Deckblatt!A3","v":"3. Spieltag  -  Landesliga Nord  -  Saison 2019"}]
["Veranstalter:",{"$f":"Deckblatt!A1","v":"Minigolfsport-Verband Bremen/Niedersachsen e.V."}]
["Datum:",{"$f":"Deckblatt!P7","v":"2019-05-05"},"Ort:",{"$f":"Deckblatt!P8","v":"Cuxhaven"}]
["System(e):",{"$f":"Deckblatt!P9","v":"Miniaturgolf"}]
[]
[null,"Name, Vorname",null,null,null,"Verein","Lizenz-Nr."]
["Turnierleiter:",{"$f":"IF(Deckblatt!D6=0,\"\",Deckblatt!D6)","v":"Reinicke, Frank"},null,null,null,{"$f":"IF(Deckblatt!G6=0,\"\",Deckblatt!G6)","v":"MC Möve Cuxhaven"},{"$f":"IF(Deckblatt!M6=0,\"\",Deckblatt!M6)","v":"17597"}]
[]
["Oberschiedsrichter:",{"$f":"IF(Deckblatt!D8=0,\"\",Deckblatt!D8)","v":"Krause, Dirk"},null,null,null,{"$f":"IF(Deckblatt!G8=0,\"\",Deckblatt!G8)","v":"BGC Celle"},{"$f":"IF(Deckblatt!M8=0,\"\",Deckblatt!M8)","v":"20839"}]
["Schiedsrichter:",{"$f":"IF(Deckblatt!D9=0,\"\",Deckblatt!D9)","v":"Hunte, Stefanie"},null,null,null,{"$f":"IF(Deckblatt!G9=0,\"\",Deckblatt!G9)","v":"BGC Diepholz"},{"$f":"IF(Deckblatt!M9=0,\"\",Deckblatt!M9)","v":"16468"}]
["Schiedsrichter:",{"$f":"IF(Deckblatt!D10=0,\"\",Deckblatt!D10)","v":"Weigang, Klaus-Dieter"},null,null,null,{"$f":"IF(Deckblatt!G10=0,\"\",Deckblatt!G10)","v":"BGC Hannover"},{"$f":"IF(Deckblatt!M10=0,\"\",Deckblatt!M10)","v":"5025"}]
[]
["Auswechselungen:",null,null,null,"Strafen:"]
["Entfällt",null,null,null,"keine"]
["Besondere Vorkommnisse:",null,null,null,"Besonderheiten, Beschädigungen oder Fehler an den Bahnen:"]
[{"$f":"Deckblatt!A13&\", \"&Deckblatt!A14","v":"keine, "},null,null,null,"keine"]
["Ausnahmen für Spieler/innen:",null,null,null,"Ausnahmen DMV-Sportordnung/int. Spielregeln:"]
["keine",null,null,null,"keine"]
["Proteste, Entscheidung Jury (bei Bedarf ist ein Extrablatt zu fertigen):"]
["keine "]
[]
["Oberschiedsrichter:","gez. Dirk Krause"]
[]
["Datum:","2019-05-05",null,"Turnierleiter:","gez. Frank Reinicke "]

{"sheet":"Einzelwertung","index":2,"n_rows":59,"n_cols":14,"rows_kept":59,"cut":false,"hidden":false,"merged":[]}
[]
["I. Einzelwertung"]
["Pl.","Nachname","Vorname","Verein","Sp.Nr.","Kat.","R1","R2","R3","R4","Ges.","ø","Diff."]
[1,{"$f":"IF(E4=\"\",\"\",IF(ISERROR(VLOOKUP(E4,Spieler,4,0)),\"Falsche Nummer!\",VLOOKUP(E4,Spieler,4,0)))","v":"Außerwinkler"},{"$f":"IF(ISERROR(VLOOKUP(E4,Spieler,3,0)),\"\",VLOOKUP(E4,Spieler,3,0))","v":"Manfred"},{"$f":"IF(ISERROR(VLOOKUP(E4,Spieler,5,0)),\"\",VLOOKUP(E4,Spieler,5,0))","v":"BGC Hannover"},32897,{"$f":"IF(ISERROR(VLOOKUP(E4,Spieler,2,0)),\"\",VLOOKUP(E4,Spieler,2,0))","v":"Sm 2"},25,24,25,22,{"$f":"IF(COUNT(G4:J4)>0,SUM(G4:J4),\"\")","v":96},{"$f":"IF(K4<>\"\",K4/COUNT(G4:J4),\"\")","v":24},{"$f":"IF(COUNT(G4:J4)>1,LARGE(G4:J4,1)-SMALL(G4:J4,1),\"\")","v":3},{"$f":"IF(F4<>\"\",VLOOKUP(F4,Kategorieliste,2,0),\"\")","v":6}]
[{"$f":"IF(B5<>\"\",A4+1,\"\")","v":2},{"$f":"IF(E5=\"\",\"\",IF(ISERROR(VLOOKUP(E5,Spieler,4,0)),\"Falsche Nummer!\",VLOOKUP(E5,Spieler,4,0)))","v":"Rotermund"},{"$f":"IF(ISERROR(VLOOKUP(E5,Spieler,3,0)),\"\",VLOOKUP(E5,Spieler,3,0))","v":"Marie Sophie"},{"$f":"IF(ISERROR(VLOOKUP(E5,Spieler,5,0)),\"\",VLOOKUP(E5,Spieler,5,0))","v":"BGC Celle"},66952,{"$f":"IF(ISERROR(VLOOKUP(E5,Spieler,2,0)),\"\",VLOOKUP(E5,Spieler,2,0))","v":"Jw"},28,22,22,25,{"$f":"IF(COUNT(G5:J5)>0,SUM(G5:J5),\"\")","v":97},{"$f":"IF(K5<>\"\",K5/COUNT(G5:J5),\"\")","v":24.25},{"$f":"IF(COUNT(G5:J5)>1,LARGE(G5:J5,1)-SMALL(G5:J5,1),\"\")","v":6},{"$f":"IF(F5<>\"\",VLOOKUP(F5,Kategorieliste,2,0),\"\")","v":7}]
[{"$f":"IF(B6<>\"\",A5+1,\"\")","v":3},{"$f":"IF(E6=\"\",\"\",IF(ISERROR(VLOOKUP(E6,Spieler,4,0)),\"Falsche Nummer!\",VLOOKUP(E6,Spieler,4,0)))","v":"Neumann"},{"$f":"IF(ISERROR(VLOOKUP(E6,Spieler,3,0)),\"\",VLOOKUP(E6,Spieler,3,0))","v":"Kevin "},{"$f":"IF(ISERROR(VLOOKUP(E6,Spieler,5,0)),\"\",VLOOKUP(E6,Spieler,5,0))","v":"BGC Celle"},38363,{"$f":"IF(ISERROR(VLOOKUP(E6,Spieler,2,0)),\"\",VLOOKUP(E6,Spieler,2,0))","v":"H"},25,21,24,27,{"$f":"IF(COUNT(G6:J6)>0,SUM(G6:J6),\"\")","v":97},{"$f":"IF(K6<>\"\",K6/COUNT(G6:J6),\"\")","v":24.25},{"$f":"IF(COUNT(G6:J6)>1,LARGE(G6:J6,1)-SMALL(G6:J6,1),\"\")","v":6},{"$f":"IF(F6<>\"\",VLOOKUP(F6,Kategorieliste,2,0),\"\")","v":2}]
[4,{"$f":"IF(E7=\"\",\"\",IF(ISERROR(VLOOKUP(E7,Spieler,4,0)),\"Falsche Nummer!\",VLOOKUP(E7,Spieler,4,0)))","v":"Michna"},{"$f":"IF(ISERROR(VLOOKUP(E7,Spieler,3,0)),\"\",VLOOKUP(E7,Spieler,3,0))","v":"Wolfgang"},{"$f":"IF(ISERROR(VLOOKUP(E7,Spieler,5,0)),\"\",VLOOKUP(E7,Spieler,5,0))","v":"MC Möve Cuxhaven"},33336,{"$f":"IF(ISERROR(VLOOKUP(E7,Spieler,2,0)),\"\",VLOOKUP(E7,Spieler,2,0))","v":"Sm 2"},23,27,23,25,{"$f":"IF(COUNT(G7:J7)>0,SUM(G7:J7),\"\")","v":98},{"$f":"IF(K7<>\"\",K7/COUNT(G7:J7),\"\")","v":24.5},{"$f":"IF(COUNT(G7:J7)>1,LARGE(G7:J7,1)-SMALL(G7:J7,1),\"\")","v":4},{"$f":"IF(F7<>\"\",VLOOKUP(F7,Kategorieliste,2,0),\"\")","v":6}]
[5,{"$f":"IF(E8=\"\",\"\",IF(ISERROR(VLOOKUP(E8,Spieler,4,0)),\"Falsche Nummer!\",VLOOKUP(E8,Spieler,4,0)))","v":"Ehm"},{"$f":"IF(ISERROR(VLOOKUP(E8,Spieler,3,0)),\"\",VLOOKUP(E8,Spieler,3,0))","v":"Marion"},{"$f":"IF(ISERROR(VLOOKUP(E8,Spieler,5,0)),\"\",VLOOKUP(E8,Spieler,5,0))","v":"BGC Celle"},46898,{"$f":"IF(ISERROR(VLOOKUP(E8,Spieler,2,0)),\"\",VLOOKUP(E8,Spieler,2,0))","v":"Sw 1"},25,25,27,23,{"$f":"IF(COUNT(G8:J8)>0,SUM(G8:J8),\"\")","v":100},{"$f":"IF(K8<>\"\",K8/COUNT(G8:J8),\"\")","v":25},{"$f":"IF(COUNT(G8:J8)>1,LARGE(G8:J8,1)-SMALL(G8:J8,1),\"\")","v":4},{"$f":"IF(F8<>\"\",VLOOKUP(F8,Kategorieliste,2,0),\"\")","v":3}]
[6,{"$f":"IF(E9=\"\",\"\",IF(ISERROR(VLOOKUP(E9,Spieler,4,0)),\"Falsche Nummer!\",VLOOKUP(E9,Spieler,4,0)))","v":"Weigang"},{"$f":"IF(ISERROR(VLOOKUP(E9,Spieler,3,0)),\"\",VLOOKUP(E9,Spieler,3,0))","v":"Barbara"},{"$f":"IF(ISERROR(VLOOKUP(E9,Spieler,5,0)),\"\",VLOOKUP(E9,Spieler,5,0))","v":"BGC Hannover"},46277,{"$f":"IF(ISERROR(VLOOKUP(E9,Spieler,2,0)),\"\",VLOOKUP(E9,Spieler,2,0))","v":"Sw 2"},25,24,26,26,{"$f":"IF(COUNT(G9:J9)>0,SUM(G9:J9),\"\")","v":101},{"$f":"IF(K9<>\"\",K9/COUNT(G9:J9),\"\")","v":25.25},{"$f":"IF(COUNT(G9:J9)>1,LARGE(G9:J9,1)-SMALL(G9:J9,1),\"\")","v":2},{"$f":"IF(F9<>\"\",VLOOKUP(F9,Kategorieliste,2,0),\"\")","v":5}]
[7,{"$f":"IF(E10=\"\",\"\",IF(ISERROR(VLOOKUP(E10,Spieler,4,0)),\"Falsche Nummer!\",VLOOKUP(E10,Spieler,4,0)))","v":"Jahrmärker"},{"$f":"IF(ISERROR(VLOOKUP(E10,Spieler,3,0)),\"\",VLOOKUP(E10,Spieler,3,0))","v":"Uta"},{"$f":"IF(ISERROR(VLOOKUP(E10,Spieler,5,0)),\"\",VLOOKUP(E10,Spieler,5,0))","v":"BGC Celle"},44499,{"$f":"IF(ISERROR(VLOOKUP(E10,Spieler,2,0)),\"\",VLOOKUP(E10,Spieler,2,0))","v":"Sw 2"},25,24,28,24,{"$f":"IF(COUNT(G10:J10)>0,SUM(G10:J10),\"\")","v":101},{"$f":"IF(K10<>\"\",K10/COUNT(G10:J10),\"\")","v":25.25},{"$f":"IF(COUNT(G10:J10)>1,LARGE(G10:J10,1)-SMALL(G10:J10,1),\"\")","v":4},{"$f":"IF(F10<>\"\",VLOOKUP(F10,Kategorieliste,2,0),\"\")","v":5}]
[8,{"$f":"IF(E11=\"\",\"\",IF(ISERROR(VLOOKUP(E11,Spieler,4,0)),\"Falsche Nummer!\",VLOOKUP(E11,Spieler,4,0)))","v":"Gaute"},{"$f":"IF(ISERROR(VLOOKUP(E11,Spieler,3,0)),\"\",VLOOKUP(E11,Spieler,3,0))","v":"Wolfgang"},{"$f":"IF(ISERROR(VLOOKUP(E11,Spieler,5,0)),\"\",VLOOKUP(E11,Spieler,5,0))","v":"VfL Lüneburg"},34092,{"$f":"IF(ISERROR(VLOOKUP(E11,Spieler,2,0)),\"\",VLOOKUP(E11,Spieler,2,0))","v":"Sm 1"},22,26,24,29,{"$f":"IF(COUNT(G11:J11)>0,SUM(G11:J11),\"\")","v":101},{"$f":"IF(K11<>\"\",K11/COUNT(G11:J11),\"\")","v":25.25},{"$f":"IF(COUNT(G11:J11)>1,LARGE(G11:J11,1)-SMALL(G11:J11,1),\"\")","v":7},{"$f":"IF(F11<>\"\",VLOOKUP(F11,Kategorieliste,2,0),\"\")","v":4}]
[9,{"$f":"IF(E12=\"\",\"\",IF(ISERROR(VLOOKUP(E12,Spieler,4,0)),\"Falsche Nummer!\",VLOOKUP(E12,Spieler,4,0)))","v":"Wesemann"},{"$f":"IF(ISERROR(VLOOKUP(E12,Spieler,3,0)),\"\",VLOOKUP(E12,Spieler,3,0))","v":"Florian"},{"$f":"IF(ISERROR(VLOOKUP(E12,Spieler,5,0)),\"\",VLOOKUP(E12,Spieler,5,0))","v":"BGC Diepholz"},35546,{"$f":"IF(ISERROR(VLOOKUP(E12,Spieler,2,0)),\"\",VLOOKUP(E12,Spieler,2,0))","v":"H"},30,25,22,25,{"$f":"IF(COUNT(G12:J12)>0,SUM(G12:J12),\"\")","v":102},{"$f":"IF(K12<>\"\",K12/COUNT(G12:J12),\"\")","v":25.5},{"$f":"IF(COUNT(G12:J12)>1,LARGE(G12:J12,1)-SMALL(G12:J12,1),\"\")","v":8},{"$f":"IF(F12<>\"\",VLOOKUP(F12,Kategorieliste,2,0),\"\")","v":2}]
[10,{"$f":"IF(E13=\"\",\"\",IF(ISERROR(VLOOKUP(E13,Spieler,4,0)),\"Falsche Nummer!\",VLOOKUP(E13,Spieler,4,0)))","v":"Prediger"},{"$f":"IF(ISERROR(VLOOKUP(E13,Spieler,3,0)),\"\",VLOOKUP(E13,Spieler,3,0))","v":"Lars"},{"$f":"IF(ISERROR(VLOOKUP(E13,Spieler,5,0)),\"\",VLOOKUP(E13,Spieler,5,0))","v":"VfL Lüneburg"},66608,{"$f":"IF(ISERROR(VLOOKUP(E13,Spieler,2,0)),\"\",VLOOKUP(E13,Spieler,2,0))","v":"H"},24,23,28,28,{"$f":"IF(COUNT(G13:J13)>0,SUM(G13:J13),\"\")","v":103},{"$f":"IF(K13<>\"\",K13/COUNT(G13:J13),\"\")","v":25.75},{"$f":"IF(COUNT(G13:J13)>1,LARGE(G13:J13,1)-SMALL(G13:J13,1),\"\")","v":5},{"$f":"IF(F13<>\"\",VLOOKUP(F13,Kategorieliste,2,0),\"\")","v":2}]
[11,{"$f":"IF(E14=\"\",\"\",IF(ISERROR(VLOOKUP(E14,Spieler,4,0)),\"Falsche Nummer!\",VLOOKUP(E14,Spieler,4,0)))","v":"Lindenberg"},{"$f":"IF(ISERROR(VLOOKUP(E14,Spieler,3,0)),\"\",VLOOKUP(E14,Spieler,3,0))","v":"Mareike"},{"$f":"IF(ISERROR(VLOOKUP(E14,Spieler,5,0)),\"\",VLOOKUP(E14,Spieler,5,0))","v":"BGC Celle"},40203,{"$f":"IF(ISERROR(VLOOKUP(E14,Spieler,2,0)),\"\",VLOOKUP(E14,Spieler,2,0))","v":"D"},30,24,25,25,{"$f":"IF(COUNT(G14:J14)>0,SUM(G14:J14),\"\")","v":104},{"$f":"IF(K14<>\"\",K14/COUNT(G14:J14),\"\")","v":26},{"$f":"IF(COUNT(G14:J14)>1,LARGE(G14:J14,1)-SMALL(G14:J14,1),\"\")","v":6},{"$f":"IF(F14<>\"\",VLOOKUP(F14,Kategorieliste,2,0),\"\")","v":1}]
[12,{"$f":"IF(E15=\"\",\"\",IF(ISERROR(VLOOKUP(E15,Spieler,4,0)),\"Falsche Nummer!\",VLOOKUP(E15,Spieler,4,0)))","v":"Beier"},{"$f":"IF(ISERROR(VLOOKUP(E15,Spieler,3,0)),\"\",VLOOKUP(E15,Spieler,3,0))","v":"Christian"},{"$f":"IF(ISERROR(VLOOKUP(E15,Spieler,5,0)),\"\",VLOOKUP(E15,Spieler,5,0))","v":"MC Möve Cuxhaven"},66569,{"$f":"IF(ISERROR(VLOOKUP(E15,Spieler,2,0)),\"\",VLOOKUP(E15,Spieler,2,0))","v":"Sm 2"},30,22,24,28,{"$f":"IF(COUNT(G15:J15)>0,SUM(G15:J15),\"\")","v":104},{"$f":"IF(K15<>\"\",K15/COUNT(G15:J15),\"\")","v":26},{"$f":"IF(COUNT(G15:J15)>1,LARGE(G15:J15,1)-SMALL(G15:J15,1),\"\")","v":8},{"$f":"IF(F15<>\"\",VLOOKUP(F15,Kategorieliste,2,0),\"\")","v":6}]
[13,{"$f":"IF(E16=\"\",\"\",IF(ISERROR(VLOOKUP(E16,Spieler,4,0)),\"Falsche Nummer!\",VLOOKUP(E16,Spieler,4,0)))","v":"Raschke"},{"$f":"IF(ISERROR(VLOOKUP(E16,Spieler,3,0)),\"\",VLOOKUP(E16,Spieler,3,0))","v":"Marcel"},{"$f":"IF(ISERROR(VLOOKUP(E16,Spieler,5,0)),\"\",VLOOKUP(E16,Spieler,5,0))","v":"BGC Diepholz"},36567,{"$f":"IF(ISERROR(VLOOKUP(E16,Spieler,2,0)),\"\",VLOOKUP(E16,Spieler,2,0))","v":"H"},28,25,26,27,{"$f":"IF(COUNT(G16:J16)>0,SUM(G16:J16),\"\")","v":106},{"$f":"IF(K16<>\"\",K16/COUNT(G16:J16),\"\")","v":26.5},{"$f":"IF(COUNT(G16:J16)>1,LARGE(G16:J16,1)-SMALL(G16:J16,1),\"\")","v":3},{"$f":"IF(F16<>\"\",VLOOKUP(F16,Kategorieliste,2,0),\"\")","v":2}]
[14,{"$f":"IF(E17=\"\",\"\",IF(ISERROR(VLOOKUP(E17,Spieler,4,0)),\"Falsche Nummer!\",VLOOKUP(E17,Spieler,4,0)))","v":"Schwarz"},{"$f":"IF(ISERROR(VLOOKUP(E17,Spieler,3,0)),\"\",VLOOKUP(E17,Spieler,3,0))","v":"Detlef"},{"$f":"IF(ISERROR(VLOOKUP(E17,Spieler,5,0)),\"\",VLOOKUP(E17,Spieler,5,0))","v":"MC Möve Cuxhaven"},49255,{"$f":"IF(ISERROR(VLOOKUP(E17,Spieler,2,0)),\"\",VLOOKUP(E17,Spieler,2,0))","v":"Sm 2"},25,30,27,25,{"$f":"IF(COUNT(G17:J17)>0,SUM(G17:J17),\"\")","v":107},{"$f":"IF(K17<>\"\",K17/COUNT(G17:J17),\"\")","v":26.75},{"$f":"IF(COUNT(G17:J17)>1,LARGE(G17:J17,1)-SMALL(G17:J17,1),\"\")","v":5},{"$f":"IF(F17<>\"\",VLOOKUP(F17,Kategorieliste,2,0),\"\")","v":6}]
[15,{"$f":"IF(E18=\"\",\"\",IF(ISERROR(VLOOKUP(E18,Spieler,4,0)),\"Falsche Nummer!\",VLOOKUP(E18,Spieler,4,0)))","v":"Weigang"},{"$f":"IF(ISERROR(VLOOKUP(E18,Spieler,3,0)),\"\",VLOOKUP(E18,Spieler,3,0))","v":"Klaus-Dieter"},{"$f":"IF(ISERROR(VLOOKUP(E18,Spieler,5,0)),\"\",VLOOKUP(E18,Spieler,5,0))","v":"BGC Hannover"},6605,{"$f":"IF(ISERROR(VLOOKUP(E18,Spieler,2,0)),\"\",VLOOKUP(E18,Spieler,2,0))","v":"Sm 2"},28,28,22,29,{"$f":"IF(COUNT(G18:J18)>0,SUM(G18:J18),\"\")","v":107},{"$f":"IF(K18<>\"\",K18/COUNT(G18:J18),\"\")","v":26.75},{"$f":"IF(COUNT(G18:J18)>1,LARGE(G18:J18,1)-SMALL(G18:J18,1),\"\")","v":7},{"$f":"IF(F18<>\"\",VLOOKUP(F18,Kategorieliste,2,0),\"\")","v":6}]
[16,{"$f":"IF(E19=\"\",\"\",IF(ISERROR(VLOOKUP(E19,Spieler,4,0)),\"Falsche Nummer!\",VLOOKUP(E19,Spieler,4,0)))","v":"Wendlandt"},{"$f":"IF(ISERROR(VLOOKUP(E19,Spieler,3,0)),\"\",VLOOKUP(E19,Spieler,3,0))","v":"Dieter"},{"$f":"IF(ISERROR(VLOOKUP(E19,Spieler,5,0)),\"\",VLOOKUP(E19,Spieler,5,0))","v":"MC Möve Cuxhaven"},49256,{"$f":"IF(ISERROR(VLOOKUP(E19,Spieler,2,0)),\"\",VLOOKUP(E19,Spieler,2,0))","v":"Sm 1"},30,29,22,26,{"$f":"IF(COUNT(G19:J19)>0,SUM(G19:J19),\"\")","v":107},{"$f":"IF(K19<>\"\",K19/COUNT(G19:J19),\"\")","v":26.75},{"$f":"IF(COUNT(G19:J19)>1,LARGE(G19:J19,1)-SMALL(G19:J19,1),\"\")","v":8},{"$f":"IF(F19<>\"\",VLOOKUP(F19,Kategorieliste,2,0),\"\")","v":4}]
[17,{"$f":"IF(E20=\"\",\"\",IF(ISERROR(VLOOKUP(E20,Spieler,4,0)),\"Falsche Nummer!\",VLOOKUP(E20,Spieler,4,0)))","v":"Krause"},{"$f":"IF(ISERROR(VLOOKUP(E20,Spieler,3,0)),\"\",VLOOKUP(E20,Spieler,3,0))","v":"Dirk"},{"$f":"IF(ISERROR(VLOOKUP(E20,Spieler,5,0)),\"\",VLOOKUP(E20,Spieler,5,0))","v":"BGC Celle"},48931,{"$f":"IF(ISERROR(VLOOKUP(E20,Spieler,2,0)),\"\",VLOOKUP(E20,Spieler,2,0))","v":"Sm 1"},30,31,22,24,{"$f":"IF(COUNT(G20:J20)>0,SUM(G20:J20),\"\")","v":107},{"$f":"IF(K20<>\"\",K20/COUNT(G20:J20),\"\")","v":26.75},{"$f":"IF(COUNT(G20:J20)>1,LARGE(G20:J20,1)-SMALL(G20:J20,1),\"\")","v":9},{"$f":"IF(F20<>\"\",VLOOKUP(F20,Kategorieliste,2,0),\"\")","v":4}]
[18,{"$f":"IF(E21=\"\",\"\",IF(ISERROR(VLOOKUP(E21,Spieler,4,0)),\"Falsche Nummer!\",VLOOKUP(E21,Spieler,4,0)))","v":"Ehm"},{"$f":"IF(ISERROR(VLOOKUP(E21,Spieler,3,0)),\"\",VLOOKUP(E21,Spieler,3,0))","v":"Christoph"},{"$f":"IF(ISERROR(VLOOKUP(E21,Spieler,5,0)),\"\",VLOOKUP(E21,Spieler,5,0))","v":"BGC Celle"},34006,{"$f":"IF(ISERROR(VLOOKUP(E21,Spieler,2,0)),\"\",VLOOKUP(E21,Spieler,2,0))","v":"H"},28,25,28,30,{"$f":"IF(COUNT(G21:J21)>0,SUM(G21:J21),\"\")","v":111},{"$f":"IF(K21<>\"\",K21/COUNT(G21:J21),\"\")","v":27.75},{"$f":"IF(COUNT(G21:J21)>1,LARGE(G21:J21,1)-SMALL(G21:J21,1),\"\")","v":5},{"$f":"IF(F21<>\"\",VLOOKUP(F21,Kategorieliste,2,0),\"\")","v":2}]
[19,{"$f":"IF(E22=\"\",\"\",IF(ISERROR(VLOOKUP(E22,Spieler,4,0)),\"Falsche Nummer!\",VLOOKUP(E22,Spieler,4,0)))","v":"Lührs"},{"$f":"IF(ISERROR(VLOOKUP(E22,Spieler,3,0)),\"\",VLOOKUP(E22,Spieler,3,0))","v":"Werner"},{"$f":"IF(ISERROR(VLOOKUP(E22,Spieler,5,0)),\"\",VLOOKUP(E22,Spieler,5,0))","v":"VfL Lüneburg"},3261,{"$f":"IF(ISERROR(VLOOKUP(E22,Spieler,2,0)),\"\",VLOOKUP(E22,Spieler,2,0))","v":"Sm 2"},29,31,26,26,{"$f":"IF(COUNT(G22:J22)>0,SUM(G22:J22),\"\")","v":112},{"$f":"IF(K22<>\"\",K22/COUNT(G22:J22),\"\")","v":28},{"$f":"IF(COUNT(G22:J22)>1,LARGE(G22:J22,1)-SMALL(G22:J22,1),\"\")","v":5},{"$f":"IF(F22<>\"\",VLOOKUP(F22,Kategorieliste,2,0),\"\")","v":6}]
[20,{"$f":"IF(E23=\"\",\"\",IF(ISERROR(VLOOKUP(E23,Spieler,4,0)),\"Falsche Nummer!\",VLOOKUP(E23,Spieler,4,0)))","v":"Müller"},{"$f":"IF(ISERROR(VLOOKUP(E23,Spieler,3,0)),\"\",VLOOKUP(E23,Spieler,3,0))","v":"Wolfgang"},{"$f":"IF(ISERROR(VLOOKUP(E23,Spieler,5,0)),\"\",VLOOKUP(E23,Spieler,5,0))","v":"VfL Lüneburg"},18367,{"$f":"IF(ISERROR(VLOOKUP(E23,Spieler,2,0)),\"\",VLOOKUP(E23,Spieler,2,0))","v":"Sm 2"},31,27,26,29,{"$f":"IF(COUNT(G23:J23)>0,SUM(G23:J23),\"\")","v":113},{"$f":"IF(K23<>\"\",K23/COUNT(G23:J23),\"\")","v":28.25},{"$f":"IF(COUNT(G23:J23)>1,LARGE(G23:J23,1)-SMALL(G23:J23,1),\"\")","v":5},{"$f":"IF(F23<>\"\",VLOOKUP(F23,Kategorieliste,2,0),\"\")","v":6}]
[21,{"$f":"IF(E24=\"\",\"\",IF(ISERROR(VLOOKUP(E24,Spieler,4,0)),\"Falsche Nummer!\",VLOOKUP(E24,Spieler,4,0)))","v":"Schaper"},{"$f":"IF(ISERROR(VLOOKUP(E24,Spieler,3,0)),\"\",VLOOKUP(E24,Spieler,3,0))","v":"Dirk"},{"$f":"IF(ISERROR(VLOOKUP(E24,Spieler,5,0)),\"\",VLOOKUP(E24,Spieler,5,0))","v":"BGC Hannover"},5062,{"$f":"IF(ISERROR(VLOOKUP(E24,Spieler,2,0)),\"\",VLOOKUP(E24,Spieler,2,0))","v":"Sm 2"},28,26,27,32,{"$f":"IF(COUNT(G24:J24)>0,SUM(G24:J24),\"\")","v":113},{"$f":"IF(K24<>\"\",K24/COUNT(G24:J24),\"\")","v":28.25},{"$f":"IF(COUNT(G24:J24)>1,LARGE(G24:J24,1)-SMALL(G24:J24,1),\"\")","v":6},{"$f":"IF(F24<>\"\",VLOOKUP(F24,Kategorieliste,2,0),\"\")","v":6}]
[22,{"$f":"IF(E25=\"\",\"\",IF(ISERROR(VLOOKUP(E25,Spieler,4,0)),\"Falsche Nummer!\",VLOOKUP(E25,Spieler,4,0)))","v":"Schilling"},{"$f":"IF(ISERROR(VLOOKUP(E25,Spieler,3,0)),\"\",VLOOKUP(E25,Spieler,3,0))","v":"Jan-Rainer"},{"$f":"IF(ISERROR(VLOOKUP(E25,Spieler,5,0)),\"\",VLOOKUP(E25,Spieler,5,0))","v":"VfL Lüneburg"},66653,{"$f":"IF(ISERROR(VLOOKUP(E25,Spieler,2,0)),\"\",VLOOKUP(E25,Spieler,2,0))","v":"H"},26,27,32,29,{"$f":"IF(COUNT(G25:J25)>0,SUM(G25:J25),\"\")","v":114},{"$f":"IF(K25<>\"\",K25/COUNT(G25:J25),\"\")","v":28.5},{"$f":"IF(COUNT(G25:J25)>1,LARGE(G25:J25,1)-SMALL(G25:J25,1),\"\")","v":6},{"$f":"IF(F25<>\"\",VLOOKUP(F25,Kategorieliste,2,0),\"\")","v":2}]
[23,{"$f":"IF(E26=\"\",\"\",IF(ISERROR(VLOOKUP(E26,Spieler,4,0)),\"Falsche Nummer!\",VLOOKUP(E26,Spieler,4,0)))","v":"Symanzyk"},{"$f":"IF(ISERROR(VLOOKUP(E26,Spieler,3,0)),\"\",VLOOKUP(E26,Spieler,3,0))","v":"Daniela"},{"$f":"IF(ISERROR(VLOOKUP(E26,Spieler,5,0)),\"\",VLOOKUP(E26,Spieler,5,0))","v":"MC Möve Cuxhaven"},31988,{"$f":"IF(ISERROR(VLOOKUP(E26,Spieler,2,0)),\"\",VLOOKUP(E26,Spieler,2,0))","v":"D"},26,29,29,31,{"$f":"IF(COUNT(G26:J26)>0,SUM(G26:J26),\"\")","v":115},{"$f":"IF(K26<>\"\",K26/COUNT(G26:J26),\"\")","v":28.75},{"$f":"IF(COUNT(G26:J26)>1,LARGE(G26:J26,1)-SMALL(G26:J26,1),\"\")","v":5},{"$f":"IF(F26<>\"\",VLOOKUP(F26,Kategorieliste,2,0),\"\")","v":1}]
[24,{"$f":"IF(E27=\"\",\"\",IF(ISERROR(VLOOKUP(E27,Spieler,4,0)),\"Falsche Nummer!\",VLOOKUP(E27,Spieler,4,0)))","v":"Dreyer"},{"$f":"IF(ISERROR(VLOOKUP(E27,Spieler,3,0)),\"\",VLOOKUP(E27,Spieler,3,0))","v":"Horst"},{"$f":"IF(ISERROR(VLOOKUP(E27,Spieler,5,0)),\"\",VLOOKUP(E27,Spieler,5,0))","v":"VfL Lüneburg"},6203,{"$f":"IF(ISERROR(VLOOKUP(E27,Spieler,2,0)),\"\",VLOOKUP(E27,Spieler,2,0))","v":"Sm 2"},27,25,33,30,{"$f":"IF(COUNT(G27:J27)>0,SUM(G27:J27),\"\")","v":115},{"$f":"IF(K27<>\"\",K27/COUNT(G27:J27),\"\")","v":28.75},{"$f":"IF(COUNT(G27:J27)>1,LARGE(G27:J27,1)-SMALL(G27:J27,1),\"\")","v":8},{"$f":"IF(F27<>\"\",VLOOKUP(F27,Kategorieliste,2,0),\"\")","v":6}]
[25,{"$f":"IF(E28=\"\",\"\",IF(ISERROR(VLOOKUP(E28,Spieler,4,0)),\"Falsche Nummer!\",VLOOKUP(E28,Spieler,4,0)))","v":"Reinicke"},{"$f":"IF(ISERROR(VLOOKUP(E28,Spieler,3,0)),\"\",VLOOKUP(E28,Spieler,3,0))","v":"Frank"},{"$f":"IF(ISERROR(VLOOKUP(E28,Spieler,5,0)),\"\",VLOOKUP(E28,Spieler,5,0))","v":"MC Möve Cuxhaven"},42691,{"$f":"IF(ISERROR(VLOOKUP(E28,Spieler,2,0)),\"\",VLOOKUP(E28,Spieler,2,0))","v":"Sm 2"},33,25,31,26,{"$f":"IF(COUNT(G28:J28)>0,SUM(G28:J28),\"\")","v":115},{"$f":"IF(K28<>\"\",K28/COUNT(G28:J28),\"\")","v":28.75},{"$f":"IF(COUNT(G28:J28)>1,LARGE(G28:J28,1)-SMALL(G28:J28,1),\"\")","v":8},{"$f":"IF(F28<>\"\",VLOOKUP(F28,Kategorieliste,2,0),\"\")","v":6}]
[26,{"$f":"IF(E29=\"\",\"\",IF(ISERROR(VLOOKUP(E29,Spieler,4,0)),\"Falsche Nummer!\",VLOOKUP(E29,Spieler,4,0)))","v":"Schlottermüller"},{"$f":"IF(ISERROR(VLOOKUP(E29,Spieler,3,0)),\"\",VLOOKUP(E29,Spieler,3,0))","v":"Rainer"},{"$f":"IF(ISERROR(VLOOKUP(E29,Spieler,5,0)),\"\",VLOOKUP(E29,Spieler,5,0))","v":"BGC Hannover"},43245,{"$f":"IF(ISERROR(VLOOKUP(E29,Spieler,2,0)),\"\",VLOOKUP(E29,Spieler,2,0))","v":"Sm 1"},32,29,31,24,{"$f":"IF(COUNT(G29:J29)>0,SUM(G29:J29),\"\")","v":116},{"$f":"IF(K29<>\"\",K29/COUNT(G29:J29),\"\")","v":29},{"$f":"IF(COUNT(G29:J29)>1,LARGE(G29:J29,1)-SMALL(G29:J29,1),\"\")","v":8},{"$f":"IF(F29<>\"\",VLOOKUP(F29,Kategorieliste,2,0),\"\")","v":4}]
[27,{"$f":"IF(E30=\"\",\"\",IF(ISERROR(VLOOKUP(E30,Spieler,4,0)),\"Falsche Nummer!\",VLOOKUP(E30,Spieler,4,0)))","v":"Lange"},{"$f":"IF(ISERROR(VLOOKUP(E30,Spieler,3,0)),\"\",VLOOKUP(E30,Spieler,3,0))","v":"Kevin"},{"$f":"IF(ISERROR(VLOOKUP(E30,Spieler,5,0)),\"\",VLOOKUP(E30,Spieler,5,0))","v":"BGC Diepholz"},879,{"$f":"IF(ISERROR(VLOOKUP(E30,Spieler,2,0)),\"\",VLOOKUP(E30,Spieler,2,0))","v":"Jm"},26,27,31,36,{"$f":"IF(COUNT(G30:J30)>0,SUM(G30:J30),\"\")","v":120},{"$f":"IF(K30<>\"\",K30/COUNT(G30:J30),\"\")","v":30},{"$f":"IF(COUNT(G30:J30)>1,LARGE(G30:J30,1)-SMALL(G30:J30,1),\"\")","v":10},{"$f":"IF(F30<>\"\",VLOOKUP(F30,Kategorieliste,2,0),\"\")","v":8}]
[28,{"$f":"IF(E31=\"\",\"\",IF(ISERROR(VLOOKUP(E31,Spieler,4,0)),\"Falsche Nummer!\",VLOOKUP(E31,Spieler,4,0)))","v":"Wesemann"},{"$f":"IF(ISERROR(VLOOKUP(E31,Spieler,3,0)),\"\",VLOOKUP(E31,Spieler,3,0))","v":"Eike-Fabian"},{"$f":"IF(ISERROR(VLOOKUP(E31,Spieler,5,0)),\"\",VLOOKUP(E31,Spieler,5,0))","v":"BGC Diepholz"},36292,{"$f":"IF(ISERROR(VLOOKUP(E31,Spieler,2,0)),\"\",VLOOKUP(E31,Spieler,2,0))","v":"H"},30,29,32,30,{"$f":"IF(COUNT(G31:J31)>0,SUM(G31:J31),\"\")","v":121},{"$f":"IF(K31<>\"\",K31/COUNT(G31:J31),\"\")","v":30.25},{"$f":"IF(COUNT(G31:J31)>1,LARGE(G31:J31,1)-SMALL(G31:J31,1),\"\")","v":3},{"$f":"IF(F31<>\"\",VLOOKUP(F31,Kategorieliste,2,0),\"\")","v":2}]
[29,{"$f":"IF(E32=\"\",\"\",IF(ISERROR(VLOOKUP(E32,Spieler,4,0)),\"Falsche Nummer!\",VLOOKUP(E32,Spieler,4,0)))","v":"Hunte"},{"$f":"IF(ISERROR(VLOOKUP(E32,Spieler,3,0)),\"\",VLOOKUP(E32,Spieler,3,0))","v":"Karl-Heinz"},{"$f":"IF(ISERROR(VLOOKUP(E32,Spieler,5,0)),\"\",VLOOKUP(E32,Spieler,5,0))","v":"BGC Diepholz"},44723,{"$f":"IF(ISERROR(VLOOKUP(E32,Spieler,2,0)),\"\",VLOOKUP(E32,Spieler,2,0))","v":"Sm 1"},35,28,28,31,{"$f":"IF(COUNT(G32:J32)>0,SUM(G32:J32),\"\")","v":122},{"$f":"IF(K32<>\"\",K32/COUNT(G32:J32),\"\")","v":30.5},{"$f":"IF(COUNT(G32:J32)>1,LARGE(G32:J32,1)-SMALL(G32:J32,1),\"\")","v":7},{"$f":"IF(F32<>\"\",VLOOKUP(F32,Kategorieliste,2,0),\"\")","v":4}]
[30,{"$f":"IF(E33=\"\",\"\",IF(ISERROR(VLOOKUP(E33,Spieler,4,0)),\"Falsche Nummer!\",VLOOKUP(E33,Spieler,4,0)))","v":"Wuttke"},{"$f":"IF(ISERROR(VLOOKUP(E33,Spieler,3,0)),\"\",VLOOKUP(E33,Spieler,3,0))","v":"Elke"},{"$f":"IF(ISERROR(VLOOKUP(E33,Spieler,5,0)),\"\",VLOOKUP(E33,Spieler,5,0))","v":"BGC Hannover"},63375,{"$f":"IF(ISERROR(VLOOKUP(E33,Spieler,2,0)),\"\",VLOOKUP(E33,Spieler,2,0))","v":"Sw 2"},30,37,29,27,{"$f":"IF(COUNT(G33:J33)>0,SUM(G33:J33),\"\")","v":123},{"$f":"IF(K33<>\"\",K33/COUNT(G33:J33),\"\")","v":30.75},{"$f":"IF(COUNT(G33:J33)>1,LARGE(G33:J33,1)-SMALL(G33:J33,1),\"\")","v":10},{"$f":"IF(F33<>\"\",VLOOKUP(F33,Kategorieliste,2,0),\"\")","v":5}]
[31,{"$f":"IF(E34=\"\",\"\",IF(ISERROR(VLOOKUP(E34,Spieler,4,0)),\"Falsche Nummer!\",VLOOKUP(E34,Spieler,4,0)))","v":"Hunte"},{"$f":"IF(ISERROR(VLOOKUP(E34,Spieler,3,0)),\"\",VLOOKUP(E34,Spieler,3,0))","v":"Stefanie"},{"$f":"IF(ISERROR(VLOOKUP(E34,Spieler,5,0)),\"\",VLOOKUP(E34,Spieler,5,0))","v":"BGC Diepholz"},40603,{"$f":"IF(ISERROR(VLOOKUP(E34,Spieler,2,0)),\"\",VLOOKUP(E34,Spieler,2,0))","v":"Sw 1"},32,29,36,35,{"$f":"IF(COUNT(G34:J34)>0,SUM(G34:J34),\"\")","v":132},{"$f":"IF(K34<>\"\",K34/COUNT(G34:J34),\"\")","v":33},{"$f":"IF(COUNT(G34:J34)>1,LARGE(G34:J34,1)-SMALL(G34:J34,1),\"\")","v":7},{"$f":"IF(F34<>\"\",VLOOKUP(F34,Kategorieliste,2,0),\"\")","v":3}]
[32,{"$f":"IF(E35=\"\",\"\",IF(ISERROR(VLOOKUP(E35,Spieler,4,0)),\"Falsche Nummer!\",VLOOKUP(E35,Spieler,4,0)))","v":"Horn"},{"$f":"IF(ISERROR(VLOOKUP(E35,Spieler,3,0)),\"\",VLOOKUP(E35,Spieler,3,0))","v":"Dennis"},{"$f":"IF(ISERROR(VLOOKUP(E35,Spieler,5,0)),\"\",VLOOKUP(E35,Spieler,5,0))","v":"BGC Diepholz"},50002,{"$f":"IF(ISERROR(VLOOKUP(E35,Spieler,2,0)),\"\",VLOOKUP(E35,Spieler,2,0))","v":"Sm 1"},31,35,36,34,{"$f":"IF(COUNT(G35:J35)>0,SUM(G35:J35),\"\")","v":136},{"$f":"IF(K35<>\"\",K35/COUNT(G35:J35),\"\")","v":34},{"$f":"IF(COUNT(G35:J35)>1,LARGE(G35:J35,1)-SMALL(G35:J35,1),\"\")","v":5},{"$f":"IF(F35<>\"\",VLOOKUP(F35,Kategorieliste,2,0),\"\")","v":4}]
["",{"$f":"IF(E36=\"\",\"\",IF(ISERROR(VLOOKUP(E36,Spieler,4,0)),\"Falsche Nummer!\",VLOOKUP(E36,Spieler,4,0)))","v":""},{"$f":"IF(ISERROR(VLOOKUP(E36,Spieler,3,0)),\"\",VLOOKUP(E36,Spieler,3,0))","v":""},{"$f":"IF(ISERROR(VLOOKUP(E36,Spieler,5,0)),\"\",VLOOKUP(E36,Spieler,5,0))","v":""},null,{"$f":"IF(ISERROR(VLOOKUP(E36,Spieler,2,0)),\"\",VLOOKUP(E36,Spieler,2,0))","v":""},null,null,null,null,{"$f":"IF(COUNT(G36:J36)>0,SUM(G36:J36),\"\")","v":""},{"$f":"IF(K36<>\"\",K36/COUNT(G36:J36),\"\")","v":""},{"$f":"IF(COUNT(G36:J36)>1,LARGE(G36:J36,1)-SMALL(G36:J36,1),\"\")","v":""},{"$f":"IF(F36<>\"\",VLOOKUP(F36,Kategorieliste,2,0),\"\")","v":""}]
["","","","",null,"",null,null,null,null,"","","",""]
["","","","",null,"",null,null,null,null,"","","",""]
["","","","",null,"",null,null,null,null,"","","",""]
["","","","",null,"",null,null,null,null,"","","",""]
["","","","",null,"",null,null,null,null,"","","",""]
["","","","",null,"",null,null,null,null,"","","",""]
["","","","",null,"",null,null,null,null,"","","",""]
["","","","",null,"",null,null,null,null,"","","",""]
["","","","",null,"",null,null,null,null,"","","",""]
["","","","",null,"",null,null,null,null,"","","",""]
["","","","",null,"",null,null,null,null,"","","",""]
["","","","",null,"",null,null,null,null,"","","",""]
["","","","",null,"",null,null,null,null,"","","",""]
["","","","",null,"",null,null,null,null,"","","",""]
["","","","",null,"",null,null,null,null,"","","",""]
["","","","",null,"",null,null,null,null,"","","",""]
["","","","",null,"",null,null,null,null,"","","",""]
["","","","",null,"",null,null,null,null,"","","",""]
["","","","",null,"",null,null,null,null,"","","",""]
["","","","",null,"",null,null,null,null,"","","",""]
["","","","",null,"",null,null,null,null,"","","",""]
["","","","",null,"",null,null,null,null,"","","",""]
["","","","",null,"",null,null,null,null,"","","",""]

{"sheet":"Kategoriewertung","index":3,"n_rows":3,"n_cols":13,"rows_kept":3,"cut":false,"hidden":true,"merged":[]}
[]
["I. Einzelwertung nach Kategorien"]
["Pl.","Nachname","Vorname","Verein","Sp.Nr.","Kat.","R1","R2","R3","R4","Ges.","ø","Diff."]

{"sheet":"Mannschaften","index":4,"n_rows":52,"n_cols":16,"rows_kept":52,"cut":false,"hidden":false,"merged":[[21,1,21,4],[23,4,23,5],[23,9,23,10],[31,1,31,4],[41,1,41,4],[43,4,43,5],[43,9,43,10],[51,1,51,4],[13,4,13,5],[13,9,13,10],[11,1,11,4],[3,4,3,5],[3,9,3,10],[33,4,33,5],[33,9,33,10]]}
["J. Mannschaftswertung:"]
[]
[]
[1,"1. BGC Celle I",null,null,null,null,null,null,"Schnitt:",{"$f":"IF(COUNTIF(INDIRECT(\"G\"&ROW()+2&\":J\"&ROW()+AnzSp+1),\">0\")>0,K12/(COUNTIF(INDIRECT(\"G\"&ROW()+2&\":J\"&ROW()+AnzSp+1),\">0\")-COUNTIF(INDIRECT(\"L\"&ROW()+2&\":O\"&ROW()+AnzSp+1),\"X\")),0)","v":24.25}]
["Nr.:","Nachname","Vorname",null,"Sp.Nr.","Kat.","R1","R2","R3","R4","Wertung",null,null,null,null,"Gesamt"]
[1,{"$f":"IF(E6=\"\",\"\",IF(ISERROR(VLOOKUP(E6,Spieler,4,0)),\"Falsche Nummer!\",VLOOKUP(E6,Spieler,4,0)))","v":"Krause"},{"$f":"IF(ISERROR(VLOOKUP(E6,Spieler,3,0)),\"\",VLOOKUP(E6,Spieler,3,0))","v":"Dirk"},null,48931,{"$f":"IF(ISERROR(VLOOKUP(E6,Spieler,2,0)),\"\",VLOOKUP(E6,Spieler,2,0))","v":"Sm 1"},{"$f":"IF(ISERROR(VLOOKUP($E6,Ergebnisse,COLUMN()-4,0)),0,VLOOKUP($E6,Ergebnisse,COLUMN()-4,0))","v":30},31,22,24,{"$f":"IF(L6=\"X\",0,G6)+IF(M6=\"X\",0,H6)+IF(N6=\"X\",0,I6)+IF(O6=\"X\",0,J6)","v":46},{"$f":"IF(G6>0,IF(AND(COUNTIF(INDIRECT(\"Z\"&(ROW()+1-$A6&\"S\"&COLUMN()-5)&\":Z\"&(ROW()+AnzSp-$A6)&\"S\"&COLUMN()-5,0),\">0\")=AnzSp-1,G6=LARGE(INDIRECT(\"Z\"&(ROW()+1-$A6&\"S\"&COLUMN()-5)&\":Z\"&(ROW()+AnzSp-$A6)&\"S\"&COLUMN()-5,0),1),COUNTIF(INDIRECT(\"Z\"&(ROW()+1-$A6&\"S\"&COLUMN()-5)&\":Z\"&(ROW())&\"S\"&COLUMN()-5,0),G6)=1),\"X\",IF(AND(COUNTIF(INDIRECT(\"Z\"&(ROW()+1-$A6&\"S\"&COLUMN()-5)&\":Z\"&(ROW()+AnzSp-$A6)&\"S\"&COLUMN()-5,0),\">0\")=AnzSp,INDIRECT(\"Z\"&(ROW()+AnzSp+1-$A6)&\"S6\",0)>0,G6=LARGE(INDIRECT(\"Z\"&(ROW()+1-$A6&\"S\"&COLUMN()-5)&\":Z\"&(ROW()+AnzSp-$A6)&\"S\"&COLUMN()-5,0),1),COUNTIF(INDIRECT(\"Z\"&(ROW()+1-$A6&\"S\"&COLUMN()-5)&\":Z\"&(ROW())&\"S\"&COLUMN()-5,0),G6)<3),\"X\",IF(AND(COUNTIF(INDIRECT(\"Z\"&(ROW()+1-$A6&\"S\"&COLUMN()-5)&\":Z\"&(ROW()+AnzSp-$A6)&\"S\"&COLUMN()-5,0),\">0\")=AnzSp,INDIRECT(\"Z\"&(ROW()+AnzSp+1-$A6)&\"S6\",0)>0,G6=LARGE(INDIRECT(\"Z\"&(ROW()+1-$A6&\"S\"&COLUMN()-5)&\":Z\"&(ROW()+AnzSp-$A6)&\"S\"&COLUMN()-5,0),2),COUNTIF(INDIRECT(\"Z\"&(ROW()+1-$A6&\"S\"&COLUMN()-5)&\":Z\"&(ROW())&\"S\"&COLUMN()-5,0),G6)=1),\"X\",\"\"))),\"\")","v":"X"},"X","","",{"$f":"SUM(G6:J6)","v":107}]
[2,"Rotermund","Marie Sophie",null,66952,"Jw",28,22,22,25,97,"","","","",{"$f":"SUM(G7:J7)","v":97}]
[3,"Neumann","Kevin ",null,38363,"H",25,21,24,27,70,"","","","X",97]
[4,"Ehm","Marion",null,46898,"Sw 1",25,25,27,23,48,"","X","X","",100]
[5,"Lindenberg","Mareike",null,40203,"D",30,24,25,25,74,"X","","","",104]
[6,{"$f":"IF(E11=\"\",\"\",IF(ISERROR(VLOOKUP(E11,Spieler,4,0)),\"Falsche Nummer!\",VLOOKUP(E11,Spieler,4,0)))","v":"Ehm"},{"$f":"IF(ISERROR(VLOOKUP(E11,Spieler,3,0)),\"\",VLOOKUP(E11,Spieler,3,0))","v":"Christoph"},null,34006,{"$f":"IF(ISERROR(VLOOKUP(E11,Spieler,2,0)),\"\",VLOOKUP(E11,Spieler,2,0))","v":"H"},28,25,28,30,{"$f":"IF(L11=\"X\",0,G11)+IF(M11=\"X\",0,H11)+IF(N11=\"X\",0,I11)+IF(O11=\"X\",0,J11)","v":53},{"$f":"IF(G11>0,IF(AND(COUNTIF(INDIRECT(\"Z\"&(ROW()+1-$A11&\"S\"&COLUMN()-5)&\":Z\"&(ROW()+AnzSp-$A11)&\"S\"&COLUMN()-5,0),\">0\")=AnzSp-1,G11=LARGE(INDIRECT(\"Z\"&(ROW()+1-$A11&\"S\"&COLUMN()-5)&\":Z\"&(ROW()+AnzSp-$A11)&\"S\"&COLUMN()-5,0),1),COUNTIF(INDIRECT(\"Z\"&(ROW()+1-$A11&\"S\"&COLUMN()-5)&\":Z\"&(ROW())&\"S\"&COLUMN()-5,0),G11)=1),\"X\",IF(AND(COUNTIF(INDIRECT(\"Z\"&(ROW()+1-$A11&\"S\"&COLUMN()-5)&\":Z\"&(ROW()+AnzSp-$A11)&\"S\"&COLUMN()-5,0),\">0\")=AnzSp,INDIRECT(\"Z\"&(ROW()+AnzSp+1-$A11)&\"S6\",0)>0,G11=LARGE(INDIRECT(\"Z\"&(ROW()+1-$A11&\"S\"&COLUMN()-5)&\":Z\"&(ROW()+AnzSp-$A11)&\"S\"&COLUMN()-5,0),1),COUNTIF(INDIRECT(\"Z\"&(ROW()+1-$A11&\"S\"&COLUMN()-5)&\":Z\"&(ROW())&\"S\"&COLUMN()-5,0),G11)<3),\"X\",IF(AND(COUNTIF(INDIRECT(\"Z\"&(ROW()+1-$A11&\"S\"&COLUMN()-5)&\":Z\"&(ROW()+AnzSp-$A11)&\"S\"&COLUMN()-5,0),\">0\")=AnzSp,INDIRECT(\"Z\"&(ROW()+AnzSp+1-$A11)&\"S6\",0)>0,G11=LARGE(INDIRECT(\"Z\"&(ROW()+1-$A11&\"S\"&COLUMN()-5)&\":Z\"&(ROW()+AnzSp-$A11)&\"S\"&COLUMN()-5,0),2),COUNTIF(INDIRECT(\"Z\"&(ROW()+1-$A11&\"S\"&COLUMN()-5)&\":Z\"&(ROW())&\"S\"&COLUMN()-5,0),G11)=1),\"X\",\"\"))),\"\")","v":""},{"$f":"IF(H11>0,IF(AND(COUNTIF(INDIRECT(\"Z\"&(ROW()+1-$A11&\"S\"&COLUMN()-5)&\":Z\"&(ROW()+AnzSp-$A11)&\"S\"&COLUMN()-5,0),\">0\")=AnzSp-1,H11=LARGE(INDIRECT(\"Z\"&(ROW()+1-$A11&\"S\"&COLUMN()-5)&\":Z\"&(ROW()+AnzSp-$A11)&\"S\"&COLUMN()-5,0),1),COUNTIF(INDIRECT(\"Z\"&(ROW()+1-$A11&\"S\"&COLUMN()-5)&\":Z\"&(ROW())&\"S\"&COLUMN()-5,0),H11)=1),\"X\",IF(AND(COUNTIF(INDIRECT(\"Z\"&(ROW()+1-$A11&\"S\"&COLUMN()-5)&\":Z\"&(ROW()+AnzSp-$A11)&\"S\"&COLUMN()-5,0),\">0\")=AnzSp,INDIRECT(\"Z\"&(ROW()+AnzSp+1-$A11)&\"S6\",0)>0,H11=LARGE(INDIRECT(\"Z\"&(ROW()+1-$A11&\"S\"&COLUMN()-5)&\":Z\"&(ROW()+AnzSp-$A11)&\"S\"&COLUMN()-5,0),1),COUNTIF(INDIRECT(\"Z\"&(ROW()+1-$A11&\"S\"&COLUMN()-5)&\":Z\"&(ROW())&\"S\"&COLUMN()-5,0),H11)<3),\"X\",IF(AND(COUNTIF(INDIRECT(\"Z\"&(ROW()+1-$A11&\"S\"&COLUMN()-5)&\":Z\"&(ROW()+AnzSp-$A11)&\"S\"&COLUMN()-5,0),\">0\")=AnzSp,INDIRECT(\"Z\"&(ROW()+AnzSp+1-$A11)&\"S6\",0)>0,H11=LARGE(INDIRECT(\"Z\"&(ROW()+1-$A11&\"S\"&COLUMN()-5)&\":Z\"&(ROW()+AnzSp-$A11)&\"S\"&COLUMN()-5,0),2),COUNTIF(INDIRECT(\"Z\"&(ROW()+1-$A11&\"S\"&COLUMN()-5)&\":Z\"&(ROW())&\"S\"&COLUMN()-5,0),H11)=1),\"X\",\"\"))),\"\")","v":""},{"$f":"IF(I11>0,IF(AND(COUNTIF(INDIRECT(\"Z\"&(ROW()+1-$A11&\"S\"&COLUMN()-5)&\":Z\"&(ROW()+AnzSp-$A11)&\"S\"&COLUMN()-5,0),\">0\")=AnzSp-1,I11=LARGE(INDIRECT(\"Z\"&(ROW()+1-$A11&\"S\"&COLUMN()-5)&\":Z\"&(ROW()+AnzSp-$A11)&\"S\"&COLUMN()-5,0),1),COUNTIF(INDIRECT(\"Z\"&(ROW()+1-$A11&\"S\"&COLUMN()-5)&\":Z\"&(ROW())&\"S\"&COLUMN()-5,0),I11)=1),\"X\",IF(AND(COUNTIF(INDIRECT(\"Z\"&(ROW()+1-$A11&\"S\"&COLUMN()-5)&\":Z\"&(ROW()+AnzSp-$A11)&\"S\"&COLUMN()-5,0),\">0\")=AnzSp,INDIRECT(\"Z\"&(ROW()+AnzSp+1-$A11)&\"S6\",0)>0,I11=LARGE(INDIRECT(\"Z\"&(ROW()+1-$A11&\"S\"&COLUMN()-5)&\":Z\"&(ROW()+AnzSp-$A11)&\"S\"&COLUMN()-5,0),1),COUNTIF(INDIRECT(\"Z\"&(ROW()+1-$A11&\"S\"&COLUMN()-5)&\":Z\"&(ROW())&\"S\"&COLUMN()-5,0),I11)<3),\"X\",IF(AND(COUNTIF(INDIRECT(\"Z\"&(ROW()+1-$A11&\"S\"&COLUMN()-5)&\":Z\"&(ROW()+AnzSp-$A11)&\"S\"&COLUMN()-5,0),\">0\")=AnzSp,INDIRECT(\"Z\"&(ROW()+AnzSp+1-$A11)&\"S6\",0)>0,I11=LARGE(INDIRECT(\"Z\"&(ROW()+1-$A11&\"S\"&COLUMN()-5)&\":Z\"&(ROW()+AnzSp-$A11)&\"S\"&COLUMN()-5,0),2),COUNTIF(INDIRECT(\"Z\"&(ROW()+1-$A11&\"S\"&COLUMN()-5)&\":Z\"&(ROW())&\"S\"&COLUMN()-5,0),I11)=1),\"X\",\"\"))),\"\")","v":"X"},{"$f":"IF(J11>0,IF(AND(COUNTIF(INDIRECT(\"Z\"&(ROW()+1-$A11&\"S\"&COLUMN()-5)&\":Z\"&(ROW()+AnzSp-$A11)&\"S\"&COLUMN()-5,0),\">0\")=AnzSp-1,J11=LARGE(INDIRECT(\"Z\"&(ROW()+1-$A11&\"S\"&COLUMN()-5)&\":Z\"&(ROW()+AnzSp-$A11)&\"S\"&COLUMN()-5,0),1),COUNTIF(INDIRECT(\"Z\"&(ROW()+1-$A11&\"S\"&COLUMN()-5)&\":Z\"&(ROW())&\"S\"&COLUMN()-5,0),J11)=1),\"X\",IF(AND(COUNTIF(INDIRECT(\"Z\"&(ROW()+1-$A11&\"S\"&COLUMN()-5)&\":Z\"&(ROW()+AnzSp-$A11)&\"S\"&COLUMN()-5,0),\">0\")=AnzSp,INDIRECT(\"Z\"&(ROW()+AnzSp+1-$A11)&\"S6\",0)>0,J11=LARGE(INDIRECT(\"Z\"&(ROW()+1-$A11&\"S\"&COLUMN()-5)&\":Z\"&(ROW()+AnzSp-$A11)&\"S\"&COLUMN()-5,0),1),COUNTIF(INDIRECT(\"Z\"&(ROW()+1-$A11&\"S\"&COLUMN()-5)&\":Z\"&(ROW())&\"S\"&COLUMN()-5,0),J11)<3),\"X\",IF(AND(COUNTIF(INDIRECT(\"Z\"&(ROW()+1-$A11&\"S\"&COLUMN()-5)&\":Z\"&(ROW()+AnzSp-$A11)&\"S\"&COLUMN()-5,0),\">0\")=AnzSp,INDIRECT(\"Z\"&(ROW()+AnzSp+1-$A11)&\"S6\",0)>0,J11=LARGE(INDIRECT(\"Z\"&(ROW()+1-$A11&\"S\"&COLUMN()-5)&\":Z\"&(ROW()+AnzSp-$A11)&\"S\"&COLUMN()-5,0),2),COUNTIF(INDIRECT(\"Z\"&(ROW()+1-$A11&\"S\"&COLUMN()-5)&\":Z\"&(ROW())&\"S\"&COLUMN()-5,0),J11)=1),\"X\",\"\"))),\"\")","v":"X"},{"$f":"SUM(G11:J11)","v":111}]
[null,{"$f":"IF(COUNT(INDIRECT(\"E\"&ROW()-AnzSp&\":E\"&ROW()-1))<=AnzSp-2,\"Kein Streicher\",IF(COUNT(INDIRECT(\"E\"&ROW()-AnzSp&\":E\"&ROW()-1))<=AnzSp-1,\"1 Streicher\",IF(AND(COUNT(INDIRECT(\"E\"&ROW()-AnzSp&\":E\"&ROW()-1))<=AnzSp,F12>0),\"2 Streicher\",\"Spieler Nr. \"&AnzSp&\" löschen und als Einzelspieler erfassen!\")))","v":"2 Streicher"},null,null,null,{"$f":"COUNTIF(INDIRECT(\"F\"&(ROW()-AnzSp)&\":F\"&ROW()-1),\"Jw\")+COUNTIF(INDIRECT(\"F\"&ROW()-AnzSp&\":F\"&ROW()-1),\"Jm\")+COUNTIF(INDIRECT(\"F\"&ROW()-AnzSp&\":F\"&ROW()-1),\"Schw\")+COUNTIF(INDIRECT(\"F\"&ROW()-AnzSp&\":F\"&ROW()-1),\"Schm\")","v":1},{"$f":"IF(COUNTIF(INDIRECT(\"G\"&ROW()-AnzSp&\":G\"&ROW()-1),\">0\")=AnzSp-2,SUM(INDIRECT(\"G\"&ROW()-AnzSp&\":G\"&ROW()-1)),IF(COUNTIF(INDIRECT(\"G\"&ROW()-AnzSp&\":G\"&ROW()-1),\">0\")=AnzSp-1,SUM(INDIRECT(\"G\"&ROW()-AnzSp&\":G\"&ROW()-1))-LARGE(INDIRECT(\"G\"&ROW()-AnzSp&\":G\"&ROW()-1),1),IF(COUNTIF(INDIRECT(\"G\"&ROW()-AnzSp&\":G\"&ROW()-1),\">0\")=AnzSp,SUM(INDIRECT(\"G\"&ROW()-AnzSp&\":G\"&ROW()-1))-LARGE(INDIRECT(\"G\"&ROW()-AnzSp&\":G\"&ROW()-1),1)-LARGE(INDIRECT(\"G\"&ROW()-AnzSp&\":G\"&ROW()-1),2),0)))","v":106},{"$f":"IF(COUNTIF(INDIRECT(\"H\"&ROW()-AnzSp&\":H\"&ROW()-1),\">0\")=AnzSp-2,SUM(INDIRECT(\"H\"&ROW()-AnzSp&\":H\"&ROW()-1)),IF(COUNTIF(INDIRECT(\"H\"&ROW()-AnzSp&\":H\"&ROW()-1),\">0\")=AnzSp-1,SUM(INDIRECT(\"H\"&ROW()-AnzSp&\":H\"&ROW()-1))-LARGE(INDIRECT(\"H\"&ROW()-AnzSp&\":H\"&ROW()-1),1),IF(COUNTIF(INDIRECT(\"H\"&ROW()-AnzSp&\":H\"&ROW()-1),\">0\")=AnzSp,SUM(INDIRECT(\"H\"&ROW()-AnzSp&\":H\"&ROW()-1))-LARGE(INDIRECT(\"H\"&ROW()-AnzSp&\":H\"&ROW()-1),1)-LARGE(INDIRECT(\"H\"&ROW()-AnzSp&\":H\"&ROW()-1),2),0)))","v":92},{"$f":"IF(COUNTIF(INDIRECT(\"I\"&ROW()-AnzSp&\":I\"&ROW()-1),\">0\")=AnzSp-2,SUM(INDIRECT(\"I\"&ROW()-AnzSp&\":I\"&ROW()-1)),IF(COUNTIF(INDIRECT(\"I\"&ROW()-AnzSp&\":I\"&ROW()-1),\">0\")=AnzSp-1,SUM(INDIRECT(\"I\"&ROW()-AnzSp&\":I\"&ROW()-1))-LARGE(INDIRECT(\"I\"&ROW()-AnzSp&\":I\"&ROW()-1),1),IF(COUNTIF(INDIRECT(\"I\"&ROW()-AnzSp&\":I\"&ROW()-1),\">0\")=AnzSp,SUM(INDIRECT(\"I\"&ROW()-AnzSp&\":I\"&ROW()-1))-LARGE(INDIRECT(\"I\"&ROW()-AnzSp&\":I\"&ROW()-1),1)-LARGE(INDIRECT(\"I\"&ROW()-AnzSp&\":I\"&ROW()-1),2),0)))","v":93},{"$f":"IF(COUNTIF(INDIRECT(\"J\"&ROW()-AnzSp&\":J\"&ROW()-1),\">0\")=AnzSp-2,SUM(INDIRECT(\"J\"&ROW()-AnzSp&\":J\"&ROW()-1)),IF(COUNTIF(INDIRECT(\"J\"&ROW()-AnzSp&\":J\"&ROW()-1),\">0\")=AnzSp-1,SUM(INDIRECT(\"J\"&ROW()-AnzSp&\":J\"&ROW()-1))-LARGE(INDIRECT(\"J\"&ROW()-AnzSp&\":J\"&ROW()-1),1),IF(COUNTIF(INDIRECT(\"J\"&ROW()-AnzSp&\":J\"&ROW()-1),\">0\")=AnzSp,SUM(INDIRECT(\"J\"&ROW()-AnzSp&\":J\"&ROW()-1))-LARGE(INDIRECT(\"J\"&ROW()-AnzSp&\":J\"&ROW()-1),1)-LARGE(INDIRECT(\"J\"&ROW()-AnzSp&\":J\"&ROW()-1),2),0)))","v":97},{"$f":"SUM(G12:J12)","v":388}]
[]
[2,"1. BGC Hannover III",null,null,null,null,null,null,"Schnitt:",{"$f":"IF(COUNTIF(INDIRECT(\"G\"&ROW()+2&\":J\"&ROW()+AnzSp+1),\">0\")>0,K22/(COUNTIF(INDIRECT(\"G\"&ROW()+2&\":J\"&ROW()+AnzSp+1),\">0\")-COUNTIF(INDIRECT(\"L\"&ROW()+2&\":O\"&ROW()+AnzSp+1),\"X\")),0)","v":25.5625}]
["Nr.:","Nachname","Vorname",null,"Sp.Nr.","Kat.","R1","R2","R3","R4","Wertung",null,null,null,null,"Gesamt"]
[1,{"$f":"IF(E16=\"\",\"\",IF(ISERROR(VLOOKUP(E16,Spieler,4,0)),\"Falsche Nummer!\",VLOOKUP(E16,Spieler,4,0)))","v":"Außerwinkler"},{"$f":"IF(ISERROR(VLOOKUP(E16,Spieler,3,0)),\"\",VLOOKUP(E16,Spieler,3,0))","v":"Manfred"},null,32897,{"$f":"IF(ISERROR(VLOOKUP(E16,Spieler,2,0)),\"\",VLOOKUP(E16,Spieler,2,0))","v":"Sm 2"},{"$f":"IF(ISERROR(VLOOKUP($E16,Ergebnisse,COLUMN()-4,0)),0,VLOOKUP($E16,Ergebnisse,COLUMN()-4,0))","v":25},{"$f":"IF(ISERROR(VLOOKUP($E16,Ergebnisse,COLUMN()-4,0)),0,VLOOKUP($E16,Ergebnisse,COLUMN()-4,0))","v":24},{"$f":"IF(ISERROR(VLOOKUP($E16,Ergebnisse,COLUMN()-4,0)),0,VLOOKUP($E16,Ergebnisse,COLUMN()-4,0))","v":25},{"$f":"IF(ISERROR(VLOOKUP($E16,Ergebnisse,COLUMN()-4,0)),0,VLOOKUP($E16,Ergebnisse,COLUMN()-4,0))","v":22},{"$f":"IF(L16=\"X\",0,G16)+IF(M16=\"X\",0,H16)+IF(N16=\"X\",0,I16)+IF(O16=\"X\",0,J16)","v":96},{"$f":"IF(G16>0,IF(AND(COUNTIF(INDIRECT(\"Z\"&(ROW()+1-$A16&\"S\"&COLUMN()-5)&\":Z\"&(ROW()+AnzSp-$A16)&\"S\"&COLUMN()-5,0),\">0\")=AnzSp-1,G16=LARGE(INDIRECT(\"Z\"&(ROW()+1-$A16&\"S\"&COLUMN()-5)&\":Z\"&(ROW()+AnzSp-$A16)&\"S\"&COLUMN()-5,0),1),COUNTIF(INDIRECT(\"Z\"&(ROW()+1-$A16&\"S\"&COLUMN()-5)&\":Z\"&(ROW())&\"S\"&COLUMN()-5,0),G16)=1),\"X\",IF(AND(COUNTIF(INDIRECT(\"Z\"&(ROW()+1-$A16&\"S\"&COLUMN()-5)&\":Z\"&(ROW()+AnzSp-$A16)&\"S\"&COLUMN()-5,0),\">0\")=AnzSp,INDIRECT(\"Z\"&(ROW()+AnzSp+1-$A16)&\"S6\",0)>0,G16=LARGE(INDIRECT(\"Z\"&(ROW()+1-$A16&\"S\"&COLUMN()-5)&\":Z\"&(ROW()+AnzSp-$A16)&\"S\"&COLUMN()-5,0),1),COUNTIF(INDIRECT(\"Z\"&(ROW()+1-$A16&\"S\"&COLUMN()-5)&\":Z\"&(ROW())&\"S\"&COLUMN()-5,0),G16)<3),\"X\",IF(AND(COUNTIF(INDIRECT(\"Z\"&(ROW()+1-$A16&\"S\"&COLUMN()-5)&\":Z\"&(ROW()+AnzSp-$A16)&\"S\"&COLUMN()-5,0),\">0\")=AnzSp,INDIRECT(\"Z\"&(ROW()+AnzSp+1-$A16)&\"S6\",0)>0,G16=LARGE(INDIRECT(\"Z\"&(ROW()+1-$A16&\"S\"&COLUMN()-5)&\":Z\"&(ROW()+AnzSp-$A16)&\"S\"&COLUMN()-5,0),2),COUNTIF(INDIRECT(\"Z\"&(ROW()+1-$A16&\"S\"&COLUMN()-5)&\":Z\"&(ROW())&\"S\"&COLUMN()-5,0),G16)=1),\"X\",\"\"))),\"\")","v":""},{"$f":"IF(H16>0,IF(AND(COUNTIF(INDIRECT(\"Z\"&(ROW()+1-$A16&\"S\"&COLUMN()-5)&\":Z\"&(ROW()+AnzSp-$A16)&\"S\"&COLUMN()-5,0),\">0\")=AnzSp-1,H16=LARGE(INDIRECT(\"Z\"&(ROW()+1-$A16&\"S\"&COLUMN()-5)&\":Z\"&(ROW()+AnzSp-$A16)&\"S\"&COLUMN()-5,0),1),COUNTIF(INDIRECT(\"Z\"&(ROW()+1-$A16&\"S\"&COLUMN()-5)&\":Z\"&(ROW())&\"S\"&COLUMN()-5,0),H16)=1),\"X\",IF(AND(COUNTIF(INDIRECT(\"Z\"&(ROW()+1-$A16&\"S\"&COLUMN()-5)&\":Z\"&(ROW()+AnzSp-$A16)&\"S\"&COLUMN()-5,0),\">0\")=AnzSp,INDIRECT(\"Z\"&(ROW()+AnzSp+1-$A16)&\"S6\",0)>0,H16=LARGE(INDIRECT(\"Z\"&(ROW()+1-$A16&\"S\"&COLUMN()-5)&\":Z\"&(ROW()+AnzSp-$A16)&\"S\"&COLUMN()-5,0),1),COUNTIF(INDIRECT(\"Z\"&(ROW()+1-$A16&\"S\"&COLUMN()-5)&\":Z\"&(ROW())&\"S\"&COLUMN()-5,0),H16)<3),\"X\",IF(AND(COUNTIF(INDIRECT(\"Z\"&(ROW()+1-$A16&\"S\"&COLUMN()-5)&\":Z\"&(ROW()+AnzSp-$A16)&\"S\"&COLUMN()-5,0),\">0\")=AnzSp,INDIRECT(\"Z\"&(ROW()+AnzSp+1-$A16)&\"S6\",0)>0,H16=LARGE(INDIRECT(\"Z\"&(ROW()+1-$A16&\"S\"&COLUMN()-5)&\":Z\"&(ROW()+AnzSp-$A16)&\"S\"&COLUMN()-5,0),2),COUNTIF(INDIRECT(\"Z\"&(ROW()+1-$A16&\"S\"&COLUMN()-5)&\":Z\"&(ROW())&\"S\"&COLUMN()-5,0),H16)=1),\"X\",\"\"))),\"\")","v":""},{"$f":"IF(I16>0,IF(AND(COUNTIF(INDIRECT(\"Z\"&(ROW()+1-$A16&\"S\"&COLUMN()-5)&\":Z\"&(ROW()+AnzSp-$A16)&\"S\"&COLUMN()-5,0),\">0\")=AnzSp-1,I16=LARGE(INDIRECT(\"Z\"&(ROW()+1-$A16&\"S\"&COLUMN()-5)&\":Z\"&(ROW()+AnzSp-$A16)&\"S\"&COLUMN()-5,0),1),COUNTIF(INDIRECT(\"Z\"&(ROW()+1-$A16&\"S\"&COLUMN()-5)&\":Z\"&(ROW())&\"S\"&COLUMN()-5,0),I16)=1),\"X\",IF(AND(COUNTIF(INDIRECT(\"Z\"&(ROW()+1-$A16&\"S\"&COLUMN()-5)&\":Z\"&(ROW()+AnzSp-$A16)&\"S\"&COLUMN()-5,0),\">0\")=AnzSp,INDIRECT(\"Z\"&(ROW()+AnzSp+1-$A16)&\"S6\",0)>0,I16=LARGE(INDIRECT(\"Z\"&(ROW()+1-$A16&\"S\"&COLUMN()-5)&\":Z\"&(ROW()+AnzSp-$A16)&\"S\"&COLUMN()-5,0),1),COUNTIF(INDIRECT(\"Z\"&(ROW()+1-$A16&\"S\"&COLUMN()-5)&\":Z\"&(ROW())&\"S\"&COLUMN()-5,0),I16)<3),\"X\",IF(AND(COUNTIF(INDIRECT(\"Z\"&(ROW()+1-$A16&\"S\"&COLUMN()-5)&\":Z\"&(ROW()+AnzSp-$A16)&\"S\"&COLUMN()-5,0),\">0\")=AnzSp,INDIRECT(\"Z\"&(ROW()+AnzSp+1-$A16)&\"S6\",0)>0,I16=LARGE(INDIRECT(\"Z\"&(ROW()+1-$A16&\"S\"&COLUMN()-5)&\":Z\"&(ROW()+AnzSp-$A16)&\"S\"&COLUMN()-5,0),2),COUNTIF(INDIRECT(\"Z\"&(ROW()+1-$A16&\"S\"&COLUMN()-5)&\":Z\"&(ROW())&\"S\"&COLUMN()-5,0),I16)=1),\"X\",\"\"))),\"\")","v":""},{"$f":"IF(J16>0,IF(AND(COUNTIF(INDIRECT(\"Z\"&(ROW()+1-$A16&\"S\"&COLUMN()-5)&\":Z\"&(ROW()+AnzSp-$A16)&\"S\"&COLUMN()-5,0),\">0\")=AnzSp-1,J16=LARGE(INDIRECT(\"Z\"&(ROW()+1-$A16&\"S\"&COLUMN()-5)&\":Z\"&(ROW()+AnzSp-$A16)&\"S\"&COLUMN()-5,0),1),COUNTIF(INDIRECT(\"Z\"&(ROW()+1-$A16&\"S\"&COLUMN()-5)&\":Z\"&(ROW())&\"S\"&COLUMN()-5,0),J16)=1),\"X\",IF(AND(COUNTIF(INDIRECT(\"Z\"&(ROW()+1-$A16&\"S\"&COLUMN()-5)&\":Z\"&(ROW()+AnzSp-$A16)&\"S\"&COLUMN()-5,0),\">0\")=AnzSp,INDIRECT(\"Z\"&(ROW()+AnzSp+1-$A16)&\"S6\",0)>0,J16=LARGE(INDIRECT(\"Z\"&(ROW()+1-$A16&\"S\"&COLUMN()-5)&\":Z\"&(ROW()+AnzSp-$A16)&\"S\"&COLUMN()-5,0),1),COUNTIF(INDIRECT(\"Z\"&(ROW()+1-$A16&\"S\"&COLUMN()-5)&\":Z\"&(ROW())&\"S\"&COLUMN()-5,0),J16)<3),\"X\",IF(AND(COUNTIF(INDIRECT(\"Z\"&(ROW()+1-$A16&\"S\"&COLUMN()-5)&\":Z\"&(ROW()+AnzSp-$A16)&\"S\"&COLUMN()-5,0),\">0\")=AnzSp,INDIRECT(\"Z\"&(ROW()+AnzSp+1-$A16)&\"S6\",0)>0,J16=LARGE(INDIRECT(\"Z\"&(ROW()+1-$A16&\"S\"&COLUMN()-5)&\":Z\"&(ROW()+AnzSp-$A16)&\"S\"&COLUMN()-5,0),2),COUNTIF(INDIRECT(\"Z\"&(ROW()+1-$A16&\"S\"&COLUMN()-5)&\":Z\"&(ROW())&\"S\"&COLUMN()-5,0),J16)=1),\"X\",\"\"))),\"\")","v":""},{"$f":"SUM(G16:J16)","v":96}]
[2,"Schaper","Dirk",null,5062,"Sm 2",{"$f":"IF(ISERROR(VLOOKUP($E17,Ergebnisse,COLUMN()-4,0)),0,VLOOKUP($E17,Ergebnisse,COLUMN()-4,0))","v":28},{"$f":"IF(ISERROR(VLOOKUP($E17,Ergebnisse,COLUMN()-4,0)),0,VLOOKUP($E17,Ergebnisse,COLUMN()-4,0))","v":26},{"$f":"IF(ISERROR(VLOOKUP($E17,Ergebnisse,COLUMN()-4,0)),0,VLOOKUP($E17,Ergebnisse,COLUMN()-4,0))","v":27},{"$f":"IF(ISERROR(VLOOKUP($E17,Ergebnisse,COLUMN()-4,0)),0,VLOOKUP($E17,Ergebnisse,COLUMN()-4,0))","v":32},81,{"$f":"IF(G17>0,IF(AND(COUNTIF(INDIRECT(\"Z\"&(ROW()+1-$A17&\"S\"&COLUMN()-5)&\":Z\"&(ROW()+AnzSp-$A17)&\"S\"&COLUMN()-5,0),\">0\")=AnzSp-1,G17=LARGE(INDIRECT(\"Z\"&(ROW()+1-$A17&\"S\"&COLUMN()-5)&\":Z\"&(ROW()+AnzSp-$A17)&\"S\"&COLUMN()-5,0),1),COUNTIF(INDIRECT(\"Z\"&(ROW()+1-$A17&\"S\"&COLUMN()-5)&\":Z\"&(ROW())&\"S\"&COLUMN()-5,0),G17)=1),\"X\",IF(AND(COUNTIF(INDIRECT(\"Z\"&(ROW()+1-$A17&\"S\"&COLUMN()-5)&\":Z\"&(ROW()+AnzSp-$A17)&\"S\"&COLUMN()-5,0),\">0\")=AnzSp,INDIRECT(\"Z\"&(ROW()+AnzSp+1-$A17)&\"S6\",0)>0,G17=LARGE(INDIRECT(\"Z\"&(ROW()+1-$A17&\"S\"&COLUMN()-5)&\":Z\"&(ROW()+AnzSp-$A17)&\"S\"&COLUMN()-5,0),1),COUNTIF(INDIRECT(\"Z\"&(ROW()+1-$A17&\"S\"&COLUMN()-5)&\":Z\"&(ROW())&\"S\"&COLUMN()-5,0),G17)<3),\"X\",IF(AND(COUNTIF(INDIRECT(\"Z\"&(ROW()+1-$A17&\"S\"&COLUMN()-5)&\":Z\"&(ROW()+AnzSp-$A17)&\"S\"&COLUMN()-5,0),\">0\")=AnzSp,INDIRECT(\"Z\"&(ROW()+AnzSp+1-$A17)&\"S6\",0)>0,G17=LARGE(INDIRECT(\"Z\"&(ROW()+1-$A17&\"S\"&COLUMN()-5)&\":Z\"&(ROW()+AnzSp-$A17)&\"S\"&COLUMN()-5,0),2),COUNTIF(INDIRECT(\"Z\"&(ROW()+1-$A17&\"S\"&COLUMN()-5)&\":Z\"&(ROW())&\"S\"&COLUMN()-5,0),G17)=1),\"X\",\"\"))),\"\")","v":""},{"$f":"IF(H17>0,IF(AND(COUNTIF(INDIRECT(\"Z\"&(ROW()+1-$A17&\"S\"&COLUMN()-5)&\":Z\"&(ROW()+AnzSp-$A17)&\"S\"&COLUMN()-5,0),\">0\")=AnzSp-1,H17=LARGE(INDIRECT(\"Z\"&(ROW()+1-$A17&\"S\"&COLUMN()-5)&\":Z\"&(ROW()+AnzSp-$A17)&\"S\"&COLUMN()-5,0),1),COUNTIF(INDIRECT(\"Z\"&(ROW()+1-$A17&\"S\"&COLUMN()-5)&\":Z\"&(ROW())&\"S\"&COLUMN()-5,0),H17)=1),\"X\",IF(AND(COUNTIF(INDIRECT(\"Z\"&(ROW()+1-$A17&\"S\"&COLUMN()-5)&\":Z\"&(ROW()+AnzSp-$A17)&\"S\"&COLUMN()-5,0),\">0\")=AnzSp,INDIRECT(\"Z\"&(ROW()+AnzSp+1-$A17)&\"S6\",0)>0,H17=LARGE(INDIRECT(\"Z\"&(ROW()+1-$A17&\"S\"&COLUMN()-5)&\":Z\"&(ROW()+AnzSp-$A17)&\"S\"&COLUMN()-5,0),1),COUNTIF(INDIRECT(\"Z\"&(ROW()+1-$A17&\"S\"&COLUMN()-5)&\":Z\"&(ROW())&\"S\"&COLUMN()-5,0),H17)<3),\"X\",IF(AND(COUNTIF(INDIRECT(\"Z\"&(ROW()+1-$A17&\"S\"&COLUMN()-5)&\":Z\"&(ROW()+AnzSp-$A17)&\"S\"&COLUMN()-5,0),\">0\")=AnzSp,INDIRECT(\"Z\"&(ROW()+AnzSp+1-$A17)&\"S6\",0)>0,H17=LARGE(INDIRECT(\"Z\"&(ROW()+1-$A17&\"S\"&COLUMN()-5)&\":Z\"&(ROW()+AnzSp-$A17)&\"S\"&COLUMN()-5,0),2),COUNTIF(INDIRECT(\"Z\"&(ROW()+1-$A17&\"S\"&COLUMN()-5)&\":Z\"&(ROW())&\"S\"&COLUMN()-5,0),H17)=1),\"X\",\"\"))),\"\")","v":""},{"$f":"IF(I17>0,IF(AND(COUNTIF(INDIRECT(\"Z\"&(ROW()+1-$A17&\"S\"&COLUMN()-5)&\":Z\"&(ROW()+AnzSp-$A17)&\"S\"&COLUMN()-5,0),\">0\")=AnzSp-1,I17=LARGE(INDIRECT(\"Z\"&(ROW()+1-$A17&\"S\"&COLUMN()-5)&\":Z\"&(ROW()+AnzSp-$A17)&\"S\"&COLUMN()-5,0),1),COUNTIF(INDIRECT(\"Z\"&(ROW()+1-$A17&\"S\"&COLUMN()-5)&\":Z\"&(ROW())&\"S\"&COLUMN()-5,0),I17)=1),\"X\",IF(AND(COUNTIF(INDIRECT(\"Z\"&(ROW()+1-$A17&\"S\"&COLUMN()-5)&\":Z\"&(ROW()+AnzSp-$A17)&\"S\"&COLUMN()-5,0),\">0\")=AnzSp,INDIRECT(\"Z\"&(ROW()+AnzSp+1-$A17)&\"S6\",0)>0,I17=LARGE(INDIRECT(\"Z\"&(ROW()+1-$A17&\"S\"&COLUMN()-5)&\":Z\"&(ROW()+AnzSp-$A17)&\"S\"&COLUMN()-5,0),1),COUNTIF(INDIRECT(\"Z\"&(ROW()+1-$A17&\"S\"&COLUMN()-5)&\":Z\"&(ROW())&\"S\"&COLUMN()-5,0),I17)<3),\"X\",IF(AND(COUNTIF(INDIRECT(\"Z\"&(ROW()+1-$A17&\"S\"&COLUMN()-5)&\":Z\"&(ROW()+AnzSp-$A17)&\"S\"&COLUMN()-5,0),\">0\")=AnzSp,INDIRECT(\"Z\"&(ROW()+AnzSp+1-$A17)&\"S6\",0)>0,I17=LARGE(INDIRECT(\"Z\"&(ROW()+1-$A17&\"S\"&COLUMN()-5)&\":Z\"&(ROW()+AnzSp-$A17)&\"S\"&COLUMN()-5,0),2),COUNTIF(INDIRECT(\"Z\"&(ROW()+1-$A17&\"S\"&COLUMN()-5)&\":Z\"&(ROW())&\"S\"&COLUMN()-5,0),I17)=1),\"X\",\"\"))),\"\")","v":""},{"$f":"IF(J17>0,IF(AND(COUNTIF(INDIRECT(\"Z\"&(ROW()+1-$A17&\"S\"&COLUMN()-5)&\":Z\"&(ROW()+AnzSp-$A17)&\"S\"&COLUMN()-5,0),\">0\")=AnzSp-1,J17=LARGE(INDIRECT(\"Z\"&(ROW()+1-$A17&\"S\"&COLUMN()-5)&\":Z\"&(ROW()+AnzSp-$A17)&\"S\"&COLUMN()-5,0),1),COUNTIF(INDIRECT(\"Z\"&(ROW()+1-$A17&\"S\"&COLUMN()-5)&\":Z\"&(ROW())&\"S\"&COLUMN()-5,0),J17)=1),\"X\",IF(AND(COUNTIF(INDIRECT(\"Z\"&(ROW()+1-$A17&\"S\"&COLUMN()-5)&\":Z\"&(ROW()+AnzSp-$A17)&\"S\"&COLUMN()-5,0),\">0\")=AnzSp,INDIRECT(\"Z\"&(ROW()+AnzSp+1-$A17)&\"S6\",0)>0,J17=LARGE(INDIRECT(\"Z\"&(ROW()+1-$A17&\"S\"&COLUMN()-5)&\":Z\"&(ROW()+AnzSp-$A17)&\"S\"&COLUMN()-5,0),1),COUNTIF(INDIRECT(\"Z\"&(ROW()+1-$A17&\"S\"&COLUMN()-5)&\":Z\"&(ROW())&\"S\"&COLUMN()-5,0),J17)<3),\"X\",IF(AND(COUNTIF(INDIRECT(\"Z\"&(ROW()+1-$A17&\"S\"&COLUMN()-5)&\":Z\"&(ROW()+AnzSp-$A17)&\"S\"&COLUMN()-5,0),\">0\")=AnzSp,INDIRECT(\"Z\"&(ROW()+AnzSp+1-$A17)&\"S6\",0)>0,J17=LARGE(INDIRECT(\"Z\"&(ROW()+1-$A17&\"S\"&COLUMN()-5)&\":Z\"&(ROW()+AnzSp-$A17)&\"S\"&COLUMN()-5,0),2),COUNTIF(INDIRECT(\"Z\"&(ROW()+1-$A17&\"S\"&COLUMN()-5)&\":Z\"&(ROW())&\"S\"&COLUMN()-5,0),J17)=1),\"X\",\"\"))),\"\")","v":"X"},{"$f":"SUM(G17:J17)","v":113}]
[3,"Weigang","Barbara",null,46277,"Sw 2",{"$f":"IF(ISERROR(VLOOKUP($E18,Ergebnisse,COLUMN()-4,0)),0,VLOOKUP($E18,Ergebnisse,COLUMN()-4,0))","v":25},{"$f":"IF(ISERROR(VLOOKUP($E18,Ergebnisse,COLUMN()-4,0)),0,VLOOKUP($E18,Ergebnisse,COLUMN()-4,0))","v":24},{"$f":"IF(ISERROR(VLOOKUP($E18,Ergebnisse,COLUMN()-4,0)),0,VLOOKUP($E18,Ergebnisse,COLUMN()-4,0))","v":26},{"$f":"IF(ISERROR(VLOOKUP($E18,Ergebnisse,COLUMN()-4,0)),0,VLOOKUP($E18,Ergebnisse,COLUMN()-4,0))","v":26},101,{"$f":"IF(G18>0,IF(AND(COUNTIF(INDIRECT(\"Z\"&(ROW()+1-$A18&\"S\"&COLUMN()-5)&\":Z\"&(ROW()+AnzSp-$A18)&\"S\"&COLUMN()-5,0),\">0\")=AnzSp-1,G18=LARGE(INDIRECT(\"Z\"&(ROW()+1-$A18&\"S\"&COLUMN()-5)&\":Z\"&(ROW()+AnzSp-$A18)&\"S\"&COLUMN()-5,0),1),COUNTIF(INDIRECT(\"Z\"&(ROW()+1-$A18&\"S\"&COLUMN()-5)&\":Z\"&(ROW())&\"S\"&COLUMN()-5,0),G18)=1),\"X\",IF(AND(COUNTIF(INDIRECT(\"Z\"&(ROW()+1-$A18&\"S\"&COLUMN()-5)&\":Z\"&(ROW()+AnzSp-$A18)&\"S\"&COLUMN()-5,0),\">0\")=AnzSp,INDIRECT(\"Z\"&(ROW()+AnzSp+1-$A18)&\"S6\",0)>0,G18=LARGE(INDIRECT(\"Z\"&(ROW()+1-$A18&\"S\"&COLUMN()-5)&\":Z\"&(ROW()+AnzSp-$A18)&\"S\"&COLUMN()-5,0),1),COUNTIF(INDIRECT(\"Z\"&(ROW()+1-$A18&\"S\"&COLUMN()-5)&\":Z\"&(ROW())&\"S\"&COLUMN()-5,0),G18)<3),\"X\",IF(AND(COUNTIF(INDIRECT(\"Z\"&(ROW()+1-$A18&\"S\"&COLUMN()-5)&\":Z\"&(ROW()+AnzSp-$A18)&\"S\"&COLUMN()-5,0),\">0\")=AnzSp,INDIRECT(\"Z\"&(ROW()+AnzSp+1-$A18)&\"S6\",0)>0,G18=LARGE(INDIRECT(\"Z\"&(ROW()+1-$A18&\"S\"&COLUMN()-5)&\":Z\"&(ROW()+AnzSp-$A18)&\"S\"&COLUMN()-5,0),2),COUNTIF(INDIRECT(\"Z\"&(ROW()+1-$A18&\"S\"&COLUMN()-5)&\":Z\"&(ROW())&\"S\"&COLUMN()-5,0),G18)=1),\"X\",\"\"))),\"\")","v":""},{"$f":"IF(H18>0,IF(AND(COUNTIF(INDIRECT(\"Z\"&(ROW()+1-$A18&\"S\"&COLUMN()-5)&\":Z\"&(ROW()+AnzSp-$A18)&\"S\"&COLUMN()-5,0),\">0\")=AnzSp-1,H18=LARGE(INDIRECT(\"Z\"&(ROW()+1-$A18&\"S\"&COLUMN()-5)&\":Z\"&(ROW()+AnzSp-$A18)&\"S\"&COLUMN()-5,0),1),COUNTIF(INDIRECT(\"Z\"&(ROW()+1-$A18&\"S\"&COLUMN()-5)&\":Z\"&(ROW())&\"S\"&COLUMN()-5,0),H18)=1),\"X\",IF(AND(COUNTIF(INDIRECT(\"Z\"&(ROW()+1-$A18&\"S\"&COLUMN()-5)&\":Z\"&(ROW()+AnzSp-$A18)&\"S\"&COLUMN()-5,0),\">0\")=AnzSp,INDIRECT(\"Z\"&(ROW()+AnzSp+1-$A18)&\"S6\",0)>0,H18=LARGE(INDIRECT(\"Z\"&(ROW()+1-$A18&\"S\"&COLUMN()-5)&\":Z\"&(ROW()+AnzSp-$A18)&\"S\"&COLUMN()-5,0),1),COUNTIF(INDIRECT(\"Z\"&(ROW()+1-$A18&\"S\"&COLUMN()-5)&\":Z\"&(ROW())&\"S\"&COLUMN()-5,0),H18)<3),\"X\",IF(AND(COUNTIF(INDIRECT(\"Z\"&(ROW()+1-$A18&\"S\"&COLUMN()-5)&\":Z\"&(ROW()+AnzSp-$A18)&\"S\"&COLUMN()-5,0),\">0\")=AnzSp,INDIRECT(\"Z\"&(ROW()+AnzSp+1-$A18)&\"S6\",0)>0,H18=LARGE(INDIRECT(\"Z\"&(ROW()+1-$A18&\"S\"&COLUMN()-5)&\":Z\"&(ROW()+AnzSp-$A18)&\"S\"&COLUMN()-5,0),2),COUNTIF(INDIRECT(\"Z\"&(ROW()+1-$A18&\"S\"&COLUMN()-5)&\":Z\"&(ROW())&\"S\"&COLUMN()-5,0),H18)=1),\"X\",\"\"))),\"\")","v":""},{"$f":"IF(I18>0,IF(AND(COUNTIF(INDIRECT(\"Z\"&(ROW()+1-$A18&\"S\"&COLUMN()-5)&\":Z\"&(ROW()+AnzSp-$A18)&\"S\"&COLUMN()-5,0),\">0\")=AnzSp-1,I18=LARGE(INDIRECT(\"Z\"&(ROW()+1-$A18&\"S\"&COLUMN()-5)&\":Z\"&(ROW()+AnzSp-$A18)&\"S\"&COLUMN()-5,0),1),COUNTIF(INDIRECT(\"Z\"&(ROW()+1-$A18&\"S\"&COLUMN()-5)&\":Z\"&(ROW())&\"S\"&COLUMN()-5,0),I18)=1),\"X\",IF(AND(COUNTIF(INDIRECT(\"Z\"&(ROW()+1-$A18&\"S\"&COLUMN()-5)&\":Z\"&(ROW()+AnzSp-$A18)&\"S\"&COLUMN()-5,0),\">0\")=AnzSp,INDIRECT(\"Z\"&(ROW()+AnzSp+1-$A18)&\"S6\",0)>0,I18=LARGE(INDIRECT(\"Z\"&(ROW()+1-$A18&\"S\"&COLUMN()-5)&\":Z\"&(ROW()+AnzSp-$A18)&\"S\"&COLUMN()-5,0),1),COUNTIF(INDIRECT(\"Z\"&(ROW()+1-$A18&\"S\"&COLUMN()-5)&\":Z\"&(ROW())&\"S\"&COLUMN()-5,0),I18)<3),\"X\",IF(AND(COUNTIF(INDIRECT(\"Z\"&(ROW()+1-$A18&\"S\"&COLUMN()-5)&\":Z\"&(ROW()+AnzSp-$A18)&\"S\"&COLUMN()-5,0),\">0\")=AnzSp,INDIRECT(\"Z\"&(ROW()+AnzSp+1-$A18)&\"S6\",0)>0,I18=LARGE(INDIRECT(\"Z\"&(ROW()+1-$A18&\"S\"&COLUMN()-5)&\":Z\"&(ROW()+AnzSp-$A18)&\"S\"&COLUMN()-5,0),2),COUNTIF(INDIRECT(\"Z\"&(ROW()+1-$A18&\"S\"&COLUMN()-5)&\":Z\"&(ROW())&\"S\"&COLUMN()-5,0),I18)=1),\"X\",\"\"))),\"\")","v":""},{"$f":"IF(J18>0,IF(AND(COUNTIF(INDIRECT(\"Z\"&(ROW()+1-$A18&\"S\"&COLUMN()-5)&\":Z\"&(ROW()+AnzSp-$A18)&\"S\"&COLUMN()-5,0),\">0\")=AnzSp-1,J18=LARGE(INDIRECT(\"Z\"&(ROW()+1-$A18&\"S\"&COLUMN()-5)&\":Z\"&(ROW()+AnzSp-$A18)&\"S\"&COLUMN()-5,0),1),COUNTIF(INDIRECT(\"Z\"&(ROW()+1-$A18&\"S\"&COLUMN()-5)&\":Z\"&(ROW())&\"S\"&COLUMN()-5,0),J18)=1),\"X\",IF(AND(COUNTIF(INDIRECT(\"Z\"&(ROW()+1-$A18&\"S\"&COLUMN()-5)&\":Z\"&(ROW()+AnzSp-$A18)&\"S\"&COLUMN()-5,0),\">0\")=AnzSp,INDIRECT(\"Z\"&(ROW()+AnzSp+1-$A18)&\"S6\",0)>0,J18=LARGE(INDIRECT(\"Z\"&(ROW()+1-$A18&\"S\"&COLUMN()-5)&\":Z\"&(ROW()+AnzSp-$A18)&\"S\"&COLUMN()-5,0),1),COUNTIF(INDIRECT(\"Z\"&(ROW()+1-$A18&\"S\"&COLUMN()-5)&\":Z\"&(ROW())&\"S\"&COLUMN()-5,0),J18)<3),\"X\",IF(AND(COUNTIF(INDIRECT(\"Z\"&(ROW()+1-$A18&\"S\"&COLUMN()-5)&\":Z\"&(ROW()+AnzSp-$A18)&\"S\"&COLUMN()-5,0),\">0\")=AnzSp,INDIRECT(\"Z\"&(ROW()+AnzSp+1-$A18)&\"S6\",0)>0,J18=LARGE(INDIRECT(\"Z\"&(ROW()+1-$A18&\"S\"&COLUMN()-5)&\":Z\"&(ROW()+AnzSp-$A18)&\"S\"&COLUMN()-5,0),2),COUNTIF(INDIRECT(\"Z\"&(ROW()+1-$A18&\"S\"&COLUMN()-5)&\":Z\"&(ROW())&\"S\"&COLUMN()-5,0),J18)=1),\"X\",\"\"))),\"\")","v":""},101]
[4,"Schlottermüller","Rainer",null,43245,"Sm 1",{"$f":"IF(ISERROR(VLOOKUP($E19,Ergebnisse,COLUMN()-4,0)),0,VLOOKUP($E19,Ergebnisse,COLUMN()-4,0))","v":32},{"$f":"IF(ISERROR(VLOOKUP($E19,Ergebnisse,COLUMN()-4,0)),0,VLOOKUP($E19,Ergebnisse,COLUMN()-4,0))","v":29},{"$f":"IF(ISERROR(VLOOKUP($E19,Ergebnisse,COLUMN()-4,0)),0,VLOOKUP($E19,Ergebnisse,COLUMN()-4,0))","v":31},{"$f":"IF(ISERROR(VLOOKUP($E19,Ergebnisse,COLUMN()-4,0)),0,VLOOKUP($E19,Ergebnisse,COLUMN()-4,0))","v":24},24,{"$f":"IF(G19>0,IF(AND(COUNTIF(INDIRECT(\"Z\"&(ROW()+1-$A19&\"S\"&COLUMN()-5)&\":Z\"&(ROW()+AnzSp-$A19)&\"S\"&COLUMN()-5,0),\">0\")=AnzSp-1,G19=LARGE(INDIRECT(\"Z\"&(ROW()+1-$A19&\"S\"&COLUMN()-5)&\":Z\"&(ROW()+AnzSp-$A19)&\"S\"&COLUMN()-5,0),1),COUNTIF(INDIRECT(\"Z\"&(ROW()+1-$A19&\"S\"&COLUMN()-5)&\":Z\"&(ROW())&\"S\"&COLUMN()-5,0),G19)=1),\"X\",IF(AND(COUNTIF(INDIRECT(\"Z\"&(ROW()+1-$A19&\"S\"&COLUMN()-5)&\":Z\"&(ROW()+AnzSp-$A19)&\"S\"&COLUMN()-5,0),\">0\")=AnzSp,INDIRECT(\"Z\"&(ROW()+AnzSp+1-$A19)&\"S6\",0)>0,G19=LARGE(INDIRECT(\"Z\"&(ROW()+1-$A19&\"S\"&COLUMN()-5)&\":Z\"&(ROW()+AnzSp-$A19)&\"S\"&COLUMN()-5,0),1),COUNTIF(INDIRECT(\"Z\"&(ROW()+1-$A19&\"S\"&COLUMN()-5)&\":Z\"&(ROW())&\"S\"&COLUMN()-5,0),G19)<3),\"X\",IF(AND(COUNTIF(INDIRECT(\"Z\"&(ROW()+1-$A19&\"S\"&COLUMN()-5)&\":Z\"&(ROW()+AnzSp-$A19)&\"S\"&COLUMN()-5,0),\">0\")=AnzSp,INDIRECT(\"Z\"&(ROW()+AnzSp+1-$A19)&\"S6\",0)>0,G19=LARGE(INDIRECT(\"Z\"&(ROW()+1-$A19&\"S\"&COLUMN()-5)&\":Z\"&(ROW()+AnzSp-$A19)&\"S\"&COLUMN()-5,0),2),COUNTIF(INDIRECT(\"Z\"&(ROW()+1-$A19&\"S\"&COLUMN()-5)&\":Z\"&(ROW())&\"S\"&COLUMN()-5,0),G19)=1),\"X\",\"\"))),\"\")","v":"X"},{"$f":"IF(H19>0,IF(AND(COUNTIF(INDIRECT(\"Z\"&(ROW()+1-$A19&\"S\"&COLUMN()-5)&\":Z\"&(ROW()+AnzSp-$A19)&\"S\"&COLUMN()-5,0),\">0\")=AnzSp-1,H19=LARGE(INDIRECT(\"Z\"&(ROW()+1-$A19&\"S\"&COLUMN()-5)&\":Z\"&(ROW()+AnzSp-$A19)&\"S\"&COLUMN()-5,0),1),COUNTIF(INDIRECT(\"Z\"&(ROW()+1-$A19&\"S\"&COLUMN()-5)&\":Z\"&(ROW())&\"S\"&COLUMN()-5,0),H19)=1),\"X\",IF(AND(COUNTIF(INDIRECT(\"Z\"&(ROW()+1-$A19&\"S\"&COLUMN()-5)&\":Z\"&(ROW()+AnzSp-$A19)&\"S\"&COLUMN()-5,0),\">0\")=AnzSp,INDIRECT(\"Z\"&(ROW()+AnzSp+1-$A19)&\"S6\",0)>0,H19=LARGE(INDIRECT(\"Z\"&(ROW()+1-$A19&\"S\"&COLUMN()-5)&\":Z\"&(ROW()+AnzSp-$A19)&\"S\"&COLUMN()-5,0),1),COUNTIF(INDIRECT(\"Z\"&(ROW()+1-$A19&\"S\"&COLUMN()-5)&\":Z\"&(ROW())&\"S\"&COLUMN()-5,0),H19)<3),\"X\",IF(AND(COUNTIF(INDIRECT(\"Z\"&(ROW()+1-$A19&\"S\"&COLUMN()-5)&\":Z\"&(ROW()+AnzSp-$A19)&\"S\"&COLUMN()-5,0),\">0\")=AnzSp,INDIRECT(\"Z\"&(ROW()+AnzSp+1-$A19)&\"S6\",0)>0,H19=LARGE(INDIRECT(\"Z\"&(ROW()+1-$A19&\"S\"&COLUMN()-5)&\":Z\"&(ROW()+AnzSp-$A19)&\"S\"&COLUMN()-5,0),2),COUNTIF(INDIRECT(\"Z\"&(ROW()+1-$A19&\"S\"&COLUMN()-5)&\":Z\"&(ROW())&\"S\"&COLUMN()-5,0),H19)=1),\"X\",\"\"))),\"\")","v":"X"},{"$f":"IF(I19>0,IF(AND(COUNTIF(INDIRECT(\"Z\"&(ROW()+1-$A19&\"S\"&COLUMN()-5)&\":Z\"&(ROW()+AnzSp-$A19)&\"S\"&COLUMN()-5,0),\">0\")=AnzSp-1,I19=LARGE(INDIRECT(\"Z\"&(ROW()+1-$A19&\"S\"&COLUMN()-5)&\":Z\"&(ROW()+AnzSp-$A19)&\"S\"&COLUMN()-5,0),1),COUNTIF(INDIRECT(\"Z\"&(ROW()+1-$A19&\"S\"&COLUMN()-5)&\":Z\"&(ROW())&\"S\"&COLUMN()-5,0),I19)=1),\"X\",IF(AND(COUNTIF(INDIRECT(\"Z\"&(ROW()+1-$A19&\"S\"&COLUMN()-5)&\":Z\"&(ROW()+AnzSp-$A19)&\"S\"&COLUMN()-5,0),\">0\")=AnzSp,INDIRECT(\"Z\"&(ROW()+AnzSp+1-$A19)&\"S6\",0)>0,I19=LARGE(INDIRECT(\"Z\"&(ROW()+1-$A19&\"S\"&COLUMN()-5)&\":Z\"&(ROW()+AnzSp-$A19)&\"S\"&COLUMN()-5,0),1),COUNTIF(INDIRECT(\"Z\"&(ROW()+1-$A19&\"S\"&COLUMN()-5)&\":Z\"&(ROW())&\"S\"&COLUMN()-5,0),I19)<3),\"X\",IF(AND(COUNTIF(INDIRECT(\"Z\"&(ROW()+1-$A19&\"S\"&COLUMN()-5)&\":Z\"&(ROW()+AnzSp-$A19)&\"S\"&COLUMN()-5,0),\">0\")=AnzSp,INDIRECT(\"Z\"&(ROW()+AnzSp+1-$A19)&\"S6\",0)>0,I19=LARGE(INDIRECT(\"Z\"&(ROW()+1-$A19&\"S\"&COLUMN()-5)&\":Z\"&(ROW()+AnzSp-$A19)&\"S\"&COLUMN()-5,0),2),COUNTIF(INDIRECT(\"Z\"&(ROW()+1-$A19&\"S\"&COLUMN()-5)&\":Z\"&(ROW())&\"S\"&COLUMN()-5,0),I19)=1),\"X\",\"\"))),\"\")","v":"X"},{"$f":"IF(J19>0,IF(AND(COUNTIF(INDIRECT(\"Z\"&(ROW()+1-$A19&\"S\"&COLUMN()-5)&\":Z\"&(ROW()+AnzSp-$A19)&\"S\"&COLUMN()-5,0),\">0\")=AnzSp-1,J19=LARGE(INDIRECT(\"Z\"&(ROW()+1-$A19&\"S\"&COLUMN()-5)&\":Z\"&(ROW()+AnzSp-$A19)&\"S\"&COLUMN()-5,0),1),COUNTIF(INDIRECT(\"Z\"&(ROW()+1-$A19&\"S\"&COLUMN()-5)&\":Z\"&(ROW())&\"S\"&COLUMN()-5,0),J19)=1),\"X\",IF(AND(COUNTIF(INDIRECT(\"Z\"&(ROW()+1-$A19&\"S\"&COLUMN()-5)&\":Z\"&(ROW()+AnzSp-$A19)&\"S\"&COLUMN()-5,0),\">0\")=AnzSp,INDIRECT(\"Z\"&(ROW()+AnzSp+1-$A19)&\"S6\",0)>0,J19=LARGE(INDIRECT(\"Z\"&(ROW()+1-$A19&\"S\"&COLUMN()-5)&\":Z\"&(ROW()+AnzSp-$A19)&\"S\"&COLUMN()-5,0),1),COUNTIF(INDIRECT(\"Z\"&(ROW()+1-$A19&\"S\"&COLUMN()-5)&\":Z\"&(ROW())&\"S\"&COLUMN()-5,0),J19)<3),\"X\",IF(AND(COUNTIF(INDIRECT(\"Z\"&(ROW()+1-$A19&\"S\"&COLUMN()-5)&\":Z\"&(ROW()+AnzSp-$A19)&\"S\"&COLUMN()-5,0),\">0\")=AnzSp,INDIRECT(\"Z\"&(ROW()+AnzSp+1-$A19)&\"S6\",0)>0,J19=LARGE(INDIRECT(\"Z\"&(ROW()+1-$A19&\"S\"&COLUMN()-5)&\":Z\"&(ROW()+AnzSp-$A19)&\"S\"&COLUMN()-5,0),2),COUNTIF(INDIRECT(\"Z\"&(ROW()+1-$A19&\"S\"&COLUMN()-5)&\":Z\"&(ROW())&\"S\"&COLUMN()-5,0),J19)=1),\"X\",\"\"))),\"\")","v":""},116]
[5,"Weigang","Klaus-Dieter",null,6605,"Sm 2",{"$f":"IF(ISERROR(VLOOKUP($E20,Ergebnisse,COLUMN()-4,0)),0,VLOOKUP($E20,Ergebnisse,COLUMN()-4,0))","v":28},{"$f":"IF(ISERROR(VLOOKUP($E20,Ergebnisse,COLUMN()-4,0)),0,VLOOKUP($E20,Ergebnisse,COLUMN()-4,0))","v":28},{"$f":"IF(ISERROR(VLOOKUP($E20,Ergebnisse,COLUMN()-4,0)),0,VLOOKUP($E20,Ergebnisse,COLUMN()-4,0))","v":22},{"$f":"IF(ISERROR(VLOOKUP($E20,Ergebnisse,COLUMN()-4,0)),0,VLOOKUP($E20,Ergebnisse,COLUMN()-4,0))","v":29},107,{"$f":"IF(G20>0,IF(AND(COUNTIF(INDIRECT(\"Z\"&(ROW()+1-$A20&\"S\"&COLUMN()-5)&\":Z\"&(ROW()+AnzSp-$A20)&\"S\"&COLUMN()-5,0),\">0\")=AnzSp-1,G20=LARGE(INDIRECT(\"Z\"&(ROW()+1-$A20&\"S\"&COLUMN()-5)&\":Z\"&(ROW()+AnzSp-$A20)&\"S\"&COLUMN()-5,0),1),COUNTIF(INDIRECT(\"Z\"&(ROW()+1-$A20&\"S\"&COLUMN()-5)&\":Z\"&(ROW())&\"S\"&COLUMN()-5,0),G20)=1),\"X\",IF(AND(COUNTIF(INDIRECT(\"Z\"&(ROW()+1-$A20&\"S\"&COLUMN()-5)&\":Z\"&(ROW()+AnzSp-$A20)&\"S\"&COLUMN()-5,0),\">0\")=AnzSp,INDIRECT(\"Z\"&(ROW()+AnzSp+1-$A20)&\"S6\",0)>0,G20=LARGE(INDIRECT(\"Z\"&(ROW()+1-$A20&\"S\"&COLUMN()-5)&\":Z\"&(ROW()+AnzSp-$A20)&\"S\"&COLUMN()-5,0),1),COUNTIF(INDIRECT(\"Z\"&(ROW()+1-$A20&\"S\"&COLUMN()-5)&\":Z\"&(ROW())&\"S\"&COLUMN()-5,0),G20)<3),\"X\",IF(AND(COUNTIF(INDIRECT(\"Z\"&(ROW()+1-$A20&\"S\"&COLUMN()-5)&\":Z\"&(ROW()+AnzSp-$A20)&\"S\"&COLUMN()-5,0),\">0\")=AnzSp,INDIRECT(\"Z\"&(ROW()+AnzSp+1-$A20)&\"S6\",0)>0,G20=LARGE(INDIRECT(\"Z\"&(ROW()+1-$A20&\"S\"&COLUMN()-5)&\":Z\"&(ROW()+AnzSp-$A20)&\"S\"&COLUMN()-5,0),2),COUNTIF(INDIRECT(\"Z\"&(ROW()+1-$A20&\"S\"&COLUMN()-5)&\":Z\"&(ROW())&\"S\"&COLUMN()-5,0),G20)=1),\"X\",\"\"))),\"\")","v":""},{"$f":"IF(H20>0,IF(AND(COUNTIF(INDIRECT(\"Z\"&(ROW()+1-$A20&\"S\"&COLUMN()-5)&\":Z\"&(ROW()+AnzSp-$A20)&\"S\"&COLUMN()-5,0),\">0\")=AnzSp-1,H20=LARGE(INDIRECT(\"Z\"&(ROW()+1-$A20&\"S\"&COLUMN()-5)&\":Z\"&(ROW()+AnzSp-$A20)&\"S\"&COLUMN()-5,0),1),COUNTIF(INDIRECT(\"Z\"&(ROW()+1-$A20&\"S\"&COLUMN()-5)&\":Z\"&(ROW())&\"S\"&COLUMN()-5,0),H20)=1),\"X\",IF(AND(COUNTIF(INDIRECT(\"Z\"&(ROW()+1-$A20&\"S\"&COLUMN()-5)&\":Z\"&(ROW()+AnzSp-$A20)&\"S\"&COLUMN()-5,0),\">0\")=AnzSp,INDIRECT(\"Z\"&(ROW()+AnzSp+1-$A20)&\"S6\",0)>0,H20=LARGE(INDIRECT(\"Z\"&(ROW()+1-$A20&\"S\"&COLUMN()-5)&\":Z\"&(ROW()+AnzSp-$A20)&\"S\"&COLUMN()-5,0),1),COUNTIF(INDIRECT(\"Z\"&(ROW()+1-$A20&\"S\"&COLUMN()-5)&\":Z\"&(ROW())&\"S\"&COLUMN()-5,0),H20)<3),\"X\",IF(AND(COUNTIF(INDIRECT(\"Z\"&(ROW()+1-$A20&\"S\"&COLUMN()-5)&\":Z\"&(ROW()+AnzSp-$A20)&\"S\"&COLUMN()-5,0),\">0\")=AnzSp,INDIRECT(\"Z\"&(ROW()+AnzSp+1-$A20)&\"S6\",0)>0,H20=LARGE(INDIRECT(\"Z\"&(ROW()+1-$A20&\"S\"&COLUMN()-5)&\":Z\"&(ROW()+AnzSp-$A20)&\"S\"&COLUMN()-5,0),2),COUNTIF(INDIRECT(\"Z\"&(ROW()+1-$A20&\"S\"&COLUMN()-5)&\":Z\"&(ROW())&\"S\"&COLUMN()-5,0),H20)=1),\"X\",\"\"))),\"\")","v":""},{"$f":"IF(I20>0,IF(AND(COUNTIF(INDIRECT(\"Z\"&(ROW()+1-$A20&\"S\"&COLUMN()-5)&\":Z\"&(ROW()+AnzSp-$A20)&\"S\"&COLUMN()-5,0),\">0\")=AnzSp-1,I20=LARGE(INDIRECT(\"Z\"&(ROW()+1-$A20&\"S\"&COLUMN()-5)&\":Z\"&(ROW()+AnzSp-$A20)&\"S\"&COLUMN()-5,0),1),COUNTIF(INDIRECT(\"Z\"&(ROW()+1-$A20&\"S\"&COLUMN()-5)&\":Z\"&(ROW())&\"S\"&COLUMN()-5,0),I20)=1),\"X\",IF(AND(COUNTIF(INDIRECT(\"Z\"&(ROW()+1-$A20&\"S\"&COLUMN()-5)&\":Z\"&(ROW()+AnzSp-$A20)&\"S\"&COLUMN()-5,0),\">0\")=AnzSp,INDIRECT(\"Z\"&(ROW()+AnzSp+1-$A20)&\"S6\",0)>0,I20=LARGE(INDIRECT(\"Z\"&(ROW()+1-$A20&\"S\"&COLUMN()-5)&\":Z\"&(ROW()+AnzSp-$A20)&\"S\"&COLUMN()-5,0),1),COUNTIF(INDIRECT(\"Z\"&(ROW()+1-$A20&\"S\"&COLUMN()-5)&\":Z\"&(ROW())&\"S\"&COLUMN()-5,0),I20)<3),\"X\",IF(AND(COUNTIF(INDIRECT(\"Z\"&(ROW()+1-$A20&\"S\"&COLUMN()-5)&\":Z\"&(ROW()+AnzSp-$A20)&\"S\"&COLUMN()-5,0),\">0\")=AnzSp,INDIRECT(\"Z\"&(ROW()+AnzSp+1-$A20)&\"S6\",0)>0,I20=LARGE(INDIRECT(\"Z\"&(ROW()+1-$A20&\"S\"&COLUMN()-5)&\":Z\"&(ROW()+AnzSp-$A20)&\"S\"&COLUMN()-5,0),2),COUNTIF(INDIRECT(\"Z\"&(ROW()+1-$A20&\"S\"&COLUMN()-5)&\":Z\"&(ROW())&\"S\"&COLUMN()-5,0),I20)=1),\"X\",\"\"))),\"\")","v":""},{"$f":"IF(J20>0,IF(AND(COUNTIF(INDIRECT(\"Z\"&(ROW()+1-$A20&\"S\"&COLUMN()-5)&\":Z\"&(ROW()+AnzSp-$A20)&\"S\"&COLUMN()-5,0),\">0\")=AnzSp-1,J20=LARGE(INDIRECT(\"Z\"&(ROW()+1-$A20&\"S\"&COLUMN()-5)&\":Z\"&(ROW()+AnzSp-$A20)&\"S\"&COLUMN()-5,0),1),COUNTIF(INDIRECT(\"Z\"&(ROW()+1-$A20&\"S\"&COLUMN()-5)&\":Z\"&(ROW())&\"S\"&COLUMN()-5,0),J20)=1),\"X\",IF(AND(COUNTIF(INDIRECT(\"Z\"&(ROW()+1-$A20&\"S\"&COLUMN()-5)&\":Z\"&(ROW()+AnzSp-$A20)&\"S\"&COLUMN()-5,0),\">0\")=AnzSp,INDIRECT(\"Z\"&(ROW()+AnzSp+1-$A20)&\"S6\",0)>0,J20=LARGE(INDIRECT(\"Z\"&(ROW()+1-$A20&\"S\"&COLUMN()-5)&\":Z\"&(ROW()+AnzSp-$A20)&\"S\"&COLUMN()-5,0),1),COUNTIF(INDIRECT(\"Z\"&(ROW()+1-$A20&\"S\"&COLUMN()-5)&\":Z\"&(ROW())&\"S\"&COLUMN()-5,0),J20)<3),\"X\",IF(AND(COUNTIF(INDIRECT(\"Z\"&(ROW()+1-$A20&\"S\"&COLUMN()-5)&\":Z\"&(ROW()+AnzSp-$A20)&\"S\"&COLUMN()-5,0),\">0\")=AnzSp,INDIRECT(\"Z\"&(ROW()+AnzSp+1-$A20)&\"S6\",0)>0,J20=LARGE(INDIRECT(\"Z\"&(ROW()+1-$A20&\"S\"&COLUMN()-5)&\":Z\"&(ROW()+AnzSp-$A20)&\"S\"&COLUMN()-5,0),2),COUNTIF(INDIRECT(\"Z\"&(ROW()+1-$A20&\"S\"&COLUMN()-5)&\":Z\"&(ROW())&\"S\"&COLUMN()-5,0),J20)=1),\"X\",\"\"))),\"\")","v":""},107]
[6,"","",null,null,"",{"$f":"IF(ISERROR(VLOOKUP($E21,Ergebnisse,COLUMN()-4,0)),0,VLOOKUP($E21,Ergebnisse,COLUMN()-4,0))","v":0},{"$f":"IF(ISERROR(VLOOKUP($E21,Ergebnisse,COLUMN()-4,0)),0,VLOOKUP($E21,Ergebnisse,COLUMN()-4,0))","v":0},{"$f":"IF(ISERROR(VLOOKUP($E21,Ergebnisse,COLUMN()-4,0)),0,VLOOKUP($E21,Ergebnisse,COLUMN()-4,0))","v":0},{"$f":"IF(ISERROR(VLOOKUP($E21,Ergebnisse,COLUMN()-4,0)),0,VLOOKUP($E21,Ergebnisse,COLUMN()-4,0))","v":0},0,{"$f":"IF(G21>0,IF(AND(COUNTIF(INDIRECT(\"Z\"&(ROW()+1-$A21&\"S\"&COLUMN()-5)&\":Z\"&(ROW()+AnzSp-$A21)&\"S\"&COLUMN()-5,0),\">0\")=AnzSp-1,G21=LARGE(INDIRECT(\"Z\"&(ROW()+1-$A21&\"S\"&COLUMN()-5)&\":Z\"&(ROW()+AnzSp-$A21)&\"S\"&COLUMN()-5,0),1),COUNTIF(INDIRECT(\"Z\"&(ROW()+1-$A21&\"S\"&COLUMN()-5)&\":Z\"&(ROW())&\"S\"&COLUMN()-5,0),G21)=1),\"X\",IF(AND(COUNTIF(INDIRECT(\"Z\"&(ROW()+1-$A21&\"S\"&COLUMN()-5)&\":Z\"&(ROW()+AnzSp-$A21)&\"S\"&COLUMN()-5,0),\">0\")=AnzSp,INDIRECT(\"Z\"&(ROW()+AnzSp+1-$A21)&\"S6\",0)>0,G21=LARGE(INDIRECT(\"Z\"&(ROW()+1-$A21&\"S\"&COLUMN()-5)&\":Z\"&(ROW()+AnzSp-$A21)&\"S\"&COLUMN()-5,0),1),COUNTIF(INDIRECT(\"Z\"&(ROW()+1-$A21&\"S\"&COLUMN()-5)&\":Z\"&(ROW())&\"S\"&COLUMN()-5,0),G21)<3),\"X\",IF(AND(COUNTIF(INDIRECT(\"Z\"&(ROW()+1-$A21&\"S\"&COLUMN()-5)&\":Z\"&(ROW()+AnzSp-$A21)&\"S\"&COLUMN()-5,0),\">0\")=AnzSp,INDIRECT(\"Z\"&(ROW()+AnzSp+1-$A21)&\"S6\",0)>0,G21=LARGE(INDIRECT(\"Z\"&(ROW()+1-$A21&\"S\"&COLUMN()-5)&\":Z\"&(ROW()+AnzSp-$A21)&\"S\"&COLUMN()-5,0),2),COUNTIF(INDIRECT(\"Z\"&(ROW()+1-$A21&\"S\"&COLUMN()-5)&\":Z\"&(ROW())&\"S\"&COLUMN()-5,0),G21)=1),\"X\",\"\"))),\"\")","v":""},{"$f":"IF(H21>0,IF(AND(COUNTIF(INDIRECT(\"Z\"&(ROW()+1-$A21&\"S\"&COLUMN()-5)&\":Z\"&(ROW()+AnzSp-$A21)&\"S\"&COLUMN()-5,0),\">0\")=AnzSp-1,H21=LARGE(INDIRECT(\"Z\"&(ROW()+1-$A21&\"S\"&COLUMN()-5)&\":Z\"&(ROW()+AnzSp-$A21)&\"S\"&COLUMN()-5,0),1),COUNTIF(INDIRECT(\"Z\"&(ROW()+1-$A21&\"S\"&COLUMN()-5)&\":Z\"&(ROW())&\"S\"&COLUMN()-5,0),H21)=1),\"X\",IF(AND(COUNTIF(INDIRECT(\"Z\"&(ROW()+1-$A21&\"S\"&COLUMN()-5)&\":Z\"&(ROW()+AnzSp-$A21)&\"S\"&COLUMN()-5,0),\">0\")=AnzSp,INDIRECT(\"Z\"&(ROW()+AnzSp+1-$A21)&\"S6\",0)>0,H21=LARGE(INDIRECT(\"Z\"&(ROW()+1-$A21&\"S\"&COLUMN()-5)&\":Z\"&(ROW()+AnzSp-$A21)&\"S\"&COLUMN()-5,0),1),COUNTIF(INDIRECT(\"Z\"&(ROW()+1-$A21&\"S\"&COLUMN()-5)&\":Z\"&(ROW())&\"S\"&COLUMN()-5,0),H21)<3),\"X\",IF(AND(COUNTIF(INDIRECT(\"Z\"&(ROW()+1-$A21&\"S\"&COLUMN()-5)&\":Z\"&(ROW()+AnzSp-$A21)&\"S\"&COLUMN()-5,0),\">0\")=AnzSp,INDIRECT(\"Z\"&(ROW()+AnzSp+1-$A21)&\"S6\",0)>0,H21=LARGE(INDIRECT(\"Z\"&(ROW()+1-$A21&\"S\"&COLUMN()-5)&\":Z\"&(ROW()+AnzSp-$A21)&\"S\"&COLUMN()-5,0),2),COUNTIF(INDIRECT(\"Z\"&(ROW()+1-$A21&\"S\"&COLUMN()-5)&\":Z\"&(ROW())&\"S\"&COLUMN()-5,0),H21)=1),\"X\",\"\"))),\"\")","v":""},{"$f":"IF(I21>0,IF(AND(COUNTIF(INDIRECT(\"Z\"&(ROW()+1-$A21&\"S\"&COLUMN()-5)&\":Z\"&(ROW()+AnzSp-$A21)&\"S\"&COLUMN()-5,0),\">0\")=AnzSp-1,I21=LARGE(INDIRECT(\"Z\"&(ROW()+1-$A21&\"S\"&COLUMN()-5)&\":Z\"&(ROW()+AnzSp-$A21)&\"S\"&COLUMN()-5,0),1),COUNTIF(INDIRECT(\"Z\"&(ROW()+1-$A21&\"S\"&COLUMN()-5)&\":Z\"&(ROW())&\"S\"&COLUMN()-5,0),I21)=1),\"X\",IF(AND(COUNTIF(INDIRECT(\"Z\"&(ROW()+1-$A21&\"S\"&COLUMN()-5)&\":Z\"&(ROW()+AnzSp-$A21)&\"S\"&COLUMN()-5,0),\">0\")=AnzSp,INDIRECT(\"Z\"&(ROW()+AnzSp+1-$A21)&\"S6\",0)>0,I21=LARGE(INDIRECT(\"Z\"&(ROW()+1-$A21&\"S\"&COLUMN()-5)&\":Z\"&(ROW()+AnzSp-$A21)&\"S\"&COLUMN()-5,0),1),COUNTIF(INDIRECT(\"Z\"&(ROW()+1-$A21&\"S\"&COLUMN()-5)&\":Z\"&(ROW())&\"S\"&COLUMN()-5,0),I21)<3),\"X\",IF(AND(COUNTIF(INDIRECT(\"Z\"&(ROW()+1-$A21&\"S\"&COLUMN()-5)&\":Z\"&(ROW()+AnzSp-$A21)&\"S\"&COLUMN()-5,0),\">0\")=AnzSp,INDIRECT(\"Z\"&(ROW()+AnzSp+1-$A21)&\"S6\",0)>0,I21=LARGE(INDIRECT(\"Z\"&(ROW()+1-$A21&\"S\"&COLUMN()-5)&\":Z\"&(ROW()+AnzSp-$A21)&\"S\"&COLUMN()-5,0),2),COUNTIF(INDIRECT(\"Z\"&(ROW()+1-$A21&\"S\"&COLUMN()-5)&\":Z\"&(ROW())&\"S\"&COLUMN()-5,0),I21)=1),\"X\",\"\"))),\"\")","v":""},{"$f":"IF(J21>0,IF(AND(COUNTIF(INDIRECT(\"Z\"&(ROW()+1-$A21&\"S\"&COLUMN()-5)&\":Z\"&(ROW()+AnzSp-$A21)&\"S\"&COLUMN()-5,0),\">0\")=AnzSp-1,J21=LARGE(INDIRECT(\"Z\"&(ROW()+1-$A21&\"S\"&COLUMN()-5)&\":Z\"&(ROW()+AnzSp-$A21)&\"S\"&COLUMN()-5,0),1),COUNTIF(INDIRECT(\"Z\"&(ROW()+1-$A21&\"S\"&COLUMN()-5)&\":Z\"&(ROW())&\"S\"&COLUMN()-5,0),J21)=1),\"X\",IF(AND(COUNTIF(INDIRECT(\"Z\"&(ROW()+1-$A21&\"S\"&COLUMN()-5)&\":Z\"&(ROW()+AnzSp-$A21)&\"S\"&COLUMN()-5,0),\">0\")=AnzSp,INDIRECT(\"Z\"&(ROW()+AnzSp+1-$A21)&\"S6\",0)>0,J21=LARGE(INDIRECT(\"Z\"&(ROW()+1-$A21&\"S\"&COLUMN()-5)&\":Z\"&(ROW()+AnzSp-$A21)&\"S\"&COLUMN()-5,0),1),COUNTIF(INDIRECT(\"Z\"&(ROW()+1-$A21&\"S\"&COLUMN()-5)&\":Z\"&(ROW())&\"S\"&COLUMN()-5,0),J21)<3),\"X\",IF(AND(COUNTIF(INDIRECT(\"Z\"&(ROW()+1-$A21&\"S\"&COLUMN()-5)&\":Z\"&(ROW()+AnzSp-$A21)&\"S\"&COLUMN()-5,0),\">0\")=AnzSp,INDIRECT(\"Z\"&(ROW()+AnzSp+1-$A21)&\"S6\",0)>0,J21=LARGE(INDIRECT(\"Z\"&(ROW()+1-$A21&\"S\"&COLUMN()-5)&\":Z\"&(ROW()+AnzSp-$A21)&\"S\"&COLUMN()-5,0),2),COUNTIF(INDIRECT(\"Z\"&(ROW()+1-$A21&\"S\"&COLUMN()-5)&\":Z\"&(ROW())&\"S\"&COLUMN()-5,0),J21)=1),\"X\",\"\"))),\"\")","v":""},0]
[null,{"$f":"IF(COUNT(INDIRECT(\"E\"&ROW()-AnzSp&\":E\"&ROW()-1))<=AnzSp-2,\"Kein Streicher\",IF(COUNT(INDIRECT(\"E\"&ROW()-AnzSp&\":E\"&ROW()-1))<=AnzSp-1,\"1 Streicher\",IF(AND(COUNT(INDIRECT(\"E\"&ROW()-AnzSp&\":E\"&ROW()-1))<=AnzSp,F22>0),\"2 Streicher\",\"Spieler Nr. \"&AnzSp&\" löschen und als Einzelspieler erfassen!\")))","v":"1 Streicher"},null,null,null,{"$f":"COUNTIF(INDIRECT(\"F\"&(ROW()-AnzSp)&\":F\"&ROW()-1),\"Jw\")+COUNTIF(INDIRECT(\"F\"&ROW()-AnzSp&\":F\"&ROW()-1),\"Jm\")+COUNTIF(INDIRECT(\"F\"&ROW()-AnzSp&\":F\"&ROW()-1),\"Schw\")+COUNTIF(INDIRECT(\"F\"&ROW()-AnzSp&\":F\"&ROW()-1),\"Schm\")","v":0},{"$f":"IF(COUNTIF(INDIRECT(\"G\"&ROW()-AnzSp&\":G\"&ROW()-1),\">0\")=AnzSp-2,SUM(INDIRECT(\"G\"&ROW()-AnzSp&\":G\"&ROW()-1)),IF(COUNTIF(INDIRECT(\"G\"&ROW()-AnzSp&\":G\"&ROW()-1),\">0\")=AnzSp-1,SUM(INDIRECT(\"G\"&ROW()-AnzSp&\":G\"&ROW()-1))-LARGE(INDIRECT(\"G\"&ROW()-AnzSp&\":G\"&ROW()-1),1),IF(COUNTIF(INDIRECT(\"G\"&ROW()-AnzSp&\":G\"&ROW()-1),\">0\")=AnzSp,SUM(INDIRECT(\"G\"&ROW()-AnzSp&\":G\"&ROW()-1))-LARGE(INDIRECT(\"G\"&ROW()-AnzSp&\":G\"&ROW()-1),1)-LARGE(INDIRECT(\"G\"&ROW()-AnzSp&\":G\"&ROW()-1),2),0)))","v":106},{"$f":"IF(COUNTIF(INDIRECT(\"H\"&ROW()-AnzSp&\":H\"&ROW()-1),\">0\")=AnzSp-2,SUM(INDIRECT(\"H\"&ROW()-AnzSp&\":H\"&ROW()-1)),IF(COUNTIF(INDIRECT(\"H\"&ROW()-AnzSp&\":H\"&ROW()-1),\">0\")=AnzSp-1,SUM(INDIRECT(\"H\"&ROW()-AnzSp&\":H\"&ROW()-1))-LARGE(INDIRECT(\"H\"&ROW()-AnzSp&\":H\"&ROW()-1),1),IF(COUNTIF(INDIRECT(\"H\"&ROW()-AnzSp&\":H\"&ROW()-1),\">0\")=AnzSp,SUM(INDIRECT(\"H\"&ROW()-AnzSp&\":H\"&ROW()-1))-LARGE(INDIRECT(\"H\"&ROW()-AnzSp&\":H\"&ROW()-1),1)-LARGE(INDIRECT(\"H\"&ROW()-AnzSp&\":H\"&ROW()-1),2),0)))","v":102},{"$f":"IF(COUNTIF(INDIRECT(\"I\"&ROW()-AnzSp&\":I\"&ROW()-1),\">0\")=AnzSp-2,SUM(INDIRECT(\"I\"&ROW()-AnzSp&\":I\"&ROW()-1)),IF(COUNTIF(INDIRECT(\"I\"&ROW()-AnzSp&\":I\"&ROW()-1),\">0\")=AnzSp-1,SUM(INDIRECT(\"I\"&ROW()-AnzSp&\":I\"&ROW()-1))-LARGE(INDIRECT(\"I\"&ROW()-AnzSp&\":I\"&ROW()-1),1),IF(COUNTIF(INDIRECT(\"I\"&ROW()-AnzSp&\":I\"&ROW()-1),\">0\")=AnzSp,SUM(INDIRECT(\"I\"&ROW()-AnzSp&\":I\"&ROW()-1))-LARGE(INDIRECT(\"I\"&ROW()-AnzSp&\":I\"&ROW()-1),1)-LARGE(INDIRECT(\"I\"&ROW()-AnzSp&\":I\"&ROW()-1),2),0)))","v":100},{"$f":"IF(COUNTIF(INDIRECT(\"J\"&ROW()-AnzSp&\":J\"&ROW()-1),\">0\")=AnzSp-2,SUM(INDIRECT(\"J\"&ROW()-AnzSp&\":J\"&ROW()-1)),IF(COUNTIF(INDIRECT(\"J\"&ROW()-AnzSp&\":J\"&ROW()-1),\">0\")=AnzSp-1,SUM(INDIRECT(\"J\"&ROW()-AnzSp&\":J\"&ROW()-1))-LARGE(INDIRECT(\"J\"&ROW()-AnzSp&\":J\"&ROW()-1),1),IF(COUNTIF(INDIRECT(\"J\"&ROW()-AnzSp&\":J\"&ROW()-1),\">0\")=AnzSp,SUM(INDIRECT(\"J\"&ROW()-AnzSp&\":J\"&ROW()-1))-LARGE(INDIRECT(\"J\"&ROW()-AnzSp&\":J\"&ROW()-1),1)-LARGE(INDIRECT(\"J\"&ROW()-AnzSp&\":J\"&ROW()-1),2),0)))","v":101},{"$f":"SUM(G22:J22)","v":409}]
[]
[3,"VfL Lüneburg I",null,null,null,null,null,null,"Schnitt:",{"$f":"IF(COUNTIF(INDIRECT(\"G\"&ROW()+2&\":J\"&ROW()+AnzSp+1),\">0\")>0,K32/(COUNTIF(INDIRECT(\"G\"&ROW()+2&\":J\"&ROW()+AnzSp+1),\">0\")-COUNTIF(INDIRECT(\"L\"&ROW()+2&\":O\"&ROW()+AnzSp+1),\"X\")),0)","v":26.1875}]
["Nr.:","Nachname","Vorname",null,"Sp.Nr.","Kat.","R1","R2","R3","R4","Wertung",null,null,null,null,"Gesamt"]
[1,{"$f":"IF(E26=\"\",\"\",IF(ISERROR(VLOOKUP(E26,Spieler,4,0)),\"Falsche Nummer!\",VLOOKUP(E26,Spieler,4,0)))","v":"Müller"},{"$f":"IF(ISERROR(VLOOKUP(E26,Spieler,3,0)),\"\",VLOOKUP(E26,Spieler,3,0))","v":"Wolfgang"},null,18367,{"$f":"IF(ISERROR(VLOOKUP(E26,Spieler,2,0)),\"\",VLOOKUP(E26,Spieler,2,0))","v":"Sm 2"},{"$f":"IF(ISERROR(VLOOKUP($E26,Ergebnisse,COLUMN()-4,0)),0,VLOOKUP($E26,Ergebnisse,COLUMN()-4,0))","v":31},{"$f":"IF(ISERROR(VLOOKUP($E26,Ergebnisse,COLUMN()-4,0)),0,VLOOKUP($E26,Ergebnisse,COLUMN()-4,0))","v":27},{"$f":"IF(ISERROR(VLOOKUP($E26,Ergebnisse,COLUMN()-4,0)),0,VLOOKUP($E26,Ergebnisse,COLUMN()-4,0))","v":26},{"$f":"IF(ISERROR(VLOOKUP($E26,Ergebnisse,COLUMN()-4,0)),0,VLOOKUP($E26,Ergebnisse,COLUMN()-4,0))","v":29},{"$f":"IF(L26=\"X\",0,G26)+IF(M26=\"X\",0,H26)+IF(N26=\"X\",0,I26)+IF(O26=\"X\",0,J26)","v":82},{"$f":"IF(G26>0,IF(AND(COUNTIF(INDIRECT(\"Z\"&(ROW()+1-$A26&\"S\"&COLUMN()-5)&\":Z\"&(ROW()+AnzSp-$A26)&\"S\"&COLUMN()-5,0),\">0\")=AnzSp-1,G26=LARGE(INDIRECT(\"Z\"&(ROW()+1-$A26&\"S\"&COLUMN()-5)&\":Z\"&(ROW()+AnzSp-$A26)&\"S\"&COLUMN()-5,0),1),COUNTIF(INDIRECT(\"Z\"&(ROW()+1-$A26&\"S\"&COLUMN()-5)&\":Z\"&(ROW())&\"S\"&COLUMN()-5,0),G26)=1),\"X\",IF(AND(COUNTIF(INDIRECT(\"Z\"&(ROW()+1-$A26&\"S\"&COLUMN()-5)&\":Z\"&(ROW()+AnzSp-$A26)&\"S\"&COLUMN()-5,0),\">0\")=AnzSp,INDIRECT(\"Z\"&(ROW()+AnzSp+1-$A26)&\"S6\",0)>0,G26=LARGE(INDIRECT(\"Z\"&(ROW()+1-$A26&\"S\"&COLUMN()-5)&\":Z\"&(ROW()+AnzSp-$A26)&\"S\"&COLUMN()-5,0),1),COUNTIF(INDIRECT(\"Z\"&(ROW()+1-$A26&\"S\"&COLUMN()-5)&\":Z\"&(ROW())&\"S\"&COLUMN()-5,0),G26)<3),\"X\",IF(AND(COUNTIF(INDIRECT(\"Z\"&(ROW()+1-$A26&\"S\"&COLUMN()-5)&\":Z\"&(ROW()+AnzSp-$A26)&\"S\"&COLUMN()-5,0),\">0\")=AnzSp,INDIRECT(\"Z\"&(ROW()+AnzSp+1-$A26)&\"S6\",0)>0,G26=LARGE(INDIRECT(\"Z\"&(ROW()+1-$A26&\"S\"&COLUMN()-5)&\":Z\"&(ROW()+AnzSp-$A26)&\"S\"&COLUMN()-5,0),2),COUNTIF(INDIRECT(\"Z\"&(ROW()+1-$A26&\"S\"&COLUMN()-5)&\":Z\"&(ROW())&\"S\"&COLUMN()-5,0),G26)=1),\"X\",\"\"))),\"\")","v":"X"},{"$f":"IF(H26>0,IF(AND(COUNTIF(INDIRECT(\"Z\"&(ROW()+1-$A26&\"S\"&COLUMN()-5)&\":Z\"&(ROW()+AnzSp-$A26)&\"S\"&COLUMN()-5,0),\">0\")=AnzSp-1,H26=LARGE(INDIRECT(\"Z\"&(ROW()+1-$A26&\"S\"&COLUMN()-5)&\":Z\"&(ROW()+AnzSp-$A26)&\"S\"&COLUMN()-5,0),1),COUNTIF(INDIRECT(\"Z\"&(ROW()+1-$A26&\"S\"&COLUMN()-5)&\":Z\"&(ROW())&\"S\"&COLUMN()-5,0),H26)=1),\"X\",IF(AND(COUNTIF(INDIRECT(\"Z\"&(ROW()+1-$A26&\"S\"&COLUMN()-5)&\":Z\"&(ROW()+AnzSp-$A26)&\"S\"&COLUMN()-5,0),\">0\")=AnzSp,INDIRECT(\"Z\"&(ROW()+AnzSp+1-$A26)&\"S6\",0)>0,H26=LARGE(INDIRECT(\"Z\"&(ROW()+1-$A26&\"S\"&COLUMN()-5)&\":Z\"&(ROW()+AnzSp-$A26)&\"S\"&COLUMN()-5,0),1),COUNTIF(INDIRECT(\"Z\"&(ROW()+1-$A26&\"S\"&COLUMN()-5)&\":Z\"&(ROW())&\"S\"&COLUMN()-5,0),H26)<3),\"X\",IF(AND(COUNTIF(INDIRECT(\"Z\"&(ROW()+1-$A26&\"S\"&COLUMN()-5)&\":Z\"&(ROW()+AnzSp-$A26)&\"S\"&COLUMN()-5,0),\">0\")=AnzSp,INDIRECT(\"Z\"&(ROW()+AnzSp+1-$A26)&\"S6\",0)>0,H26=LARGE(INDIRECT(\"Z\"&(ROW()+1-$A26&\"S\"&COLUMN()-5)&\":Z\"&(ROW()+AnzSp-$A26)&\"S\"&COLUMN()-5,0),2),COUNTIF(INDIRECT(\"Z\"&(ROW()+1-$A26&\"S\"&COLUMN()-5)&\":Z\"&(ROW())&\"S\"&COLUMN()-5,0),H26)=1),\"X\",\"\"))),\"\")","v":""},{"$f":"IF(I26>0,IF(AND(COUNTIF(INDIRECT(\"Z\"&(ROW()+1-$A26&\"S\"&COLUMN()-5)&\":Z\"&(ROW()+AnzSp-$A26)&\"S\"&COLUMN()-5,0),\">0\")=AnzSp-1,I26=LARGE(INDIRECT(\"Z\"&(ROW()+1-$A26&\"S\"&COLUMN()-5)&\":Z\"&(ROW()+AnzSp-$A26)&\"S\"&COLUMN()-5,0),1),COUNTIF(INDIRECT(\"Z\"&(ROW()+1-$A26&\"S\"&COLUMN()-5)&\":Z\"&(ROW())&\"S\"&COLUMN()-5,0),I26)=1),\"X\",IF(AND(COUNTIF(INDIRECT(\"Z\"&(ROW()+1-$A26&\"S\"&COLUMN()-5)&\":Z\"&(ROW()+AnzSp-$A26)&\"S\"&COLUMN()-5,0),\">0\")=AnzSp,INDIRECT(\"Z\"&(ROW()+AnzSp+1-$A26)&\"S6\",0)>0,I26=LARGE(INDIRECT(\"Z\"&(ROW()+1-$A26&\"S\"&COLUMN()-5)&\":Z\"&(ROW()+AnzSp-$A26)&\"S\"&COLUMN()-5,0),1),COUNTIF(INDIRECT(\"Z\"&(ROW()+1-$A26&\"S\"&COLUMN()-5)&\":Z\"&(ROW())&\"S\"&COLUMN()-5,0),I26)<3),\"X\",IF(AND(COUNTIF(INDIRECT(\"Z\"&(ROW()+1-$A26&\"S\"&COLUMN()-5)&\":Z\"&(ROW()+AnzSp-$A26)&\"S\"&COLUMN()-5,0),\">0\")=AnzSp,INDIRECT(\"Z\"&(ROW()+AnzSp+1-$A26)&\"S6\",0)>0,I26=LARGE(INDIRECT(\"Z\"&(ROW()+1-$A26&\"S\"&COLUMN()-5)&\":Z\"&(ROW()+AnzSp-$A26)&\"S\"&COLUMN()-5,0),2),COUNTIF(INDIRECT(\"Z\"&(ROW()+1-$A26&\"S\"&COLUMN()-5)&\":Z\"&(ROW())&\"S\"&COLUMN()-5,0),I26)=1),\"X\",\"\"))),\"\")","v":""},{"$f":"IF(J26>0,IF(AND(COUNTIF(INDIRECT(\"Z\"&(ROW()+1-$A26&\"S\"&COLUMN()-5)&\":Z\"&(ROW()+AnzSp-$A26)&\"S\"&COLUMN()-5,0),\">0\")=AnzSp-1,J26=LARGE(INDIRECT(\"Z\"&(ROW()+1-$A26&\"S\"&COLUMN()-5)&\":Z\"&(ROW()+AnzSp-$A26)&\"S\"&COLUMN()-5,0),1),COUNTIF(INDIRECT(\"Z\"&(ROW()+1-$A26&\"S\"&COLUMN()-5)&\":Z\"&(ROW())&\"S\"&COLUMN()-5,0),J26)=1),\"X\",IF(AND(COUNTIF(INDIRECT(\"Z\"&(ROW()+1-$A26&\"S\"&COLUMN()-5)&\":Z\"&(ROW()+AnzSp-$A26)&\"S\"&COLUMN()-5,0),\">0\")=AnzSp,INDIRECT(\"Z\"&(ROW()+AnzSp+1-$A26)&\"S6\",0)>0,J26=LARGE(INDIRECT(\"Z\"&(ROW()+1-$A26&\"S\"&COLUMN()-5)&\":Z\"&(ROW()+AnzSp-$A26)&\"S\"&COLUMN()-5,0),1),COUNTIF(INDIRECT(\"Z\"&(ROW()+1-$A26&\"S\"&COLUMN()-5)&\":Z\"&(ROW())&\"S\"&COLUMN()-5,0),J26)<3),\"X\",IF(AND(COUNTIF(INDIRECT(\"Z\"&(ROW()+1-$A26&\"S\"&COLUMN()-5)&\":Z\"&(ROW()+AnzSp-$A26)&\"S\"&COLUMN()-5,0),\">0\")=AnzSp,INDIRECT(\"Z\"&(ROW()+AnzSp+1-$A26)&\"S6\",0)>0,J26=LARGE(INDIRECT(\"Z\"&(ROW()+1-$A26&\"S\"&COLUMN()-5)&\":Z\"&(ROW()+AnzSp-$A26)&\"S\"&COLUMN()-5,0),2),COUNTIF(INDIRECT(\"Z\"&(ROW()+1-$A26&\"S\"&COLUMN()-5)&\":Z\"&(ROW())&\"S\"&COLUMN()-5,0),J26)=1),\"X\",\"\"))),\"\")","v":""},{"$f":"SUM(G26:J26)","v":113}]
[2,"Dreyer","Horst",null,6203,"Sm 2",{"$f":"IF(ISERROR(VLOOKUP($E27,Ergebnisse,COLUMN()-4,0)),0,VLOOKUP($E27,Ergebnisse,COLUMN()-4,0))","v":27},{"$f":"IF(ISERROR(VLOOKUP($E27,Ergebnisse,COLUMN()-4,0)),0,VLOOKUP($E27,Ergebnisse,COLUMN()-4,0))","v":25},{"$f":"IF(ISERROR(VLOOKUP($E27,Ergebnisse,COLUMN()-4,0)),0,VLOOKUP($E27,Ergebnisse,COLUMN()-4,0))","v":33},{"$f":"IF(ISERROR(VLOOKUP($E27,Ergebnisse,COLUMN()-4,0)),0,VLOOKUP($E27,Ergebnisse,COLUMN()-4,0))","v":30},52,{"$f":"IF(G27>0,IF(AND(COUNTIF(INDIRECT(\"Z\"&(ROW()+1-$A27&\"S\"&COLUMN()-5)&\":Z\"&(ROW()+AnzSp-$A27)&\"S\"&COLUMN()-5,0),\">0\")=AnzSp-1,G27=LARGE(INDIRECT(\"Z\"&(ROW()+1-$A27&\"S\"&COLUMN()-5)&\":Z\"&(ROW()+AnzSp-$A27)&\"S\"&COLUMN()-5,0),1),COUNTIF(INDIRECT(\"Z\"&(ROW()+1-$A27&\"S\"&COLUMN()-5)&\":Z\"&(ROW())&\"S\"&COLUMN()-5,0),G27)=1),\"X\",IF(AND(COUNTIF(INDIRECT(\"Z\"&(ROW()+1-$A27&\"S\"&COLUMN()-5)&\":Z\"&(ROW()+AnzSp-$A27)&\"S\"&COLUMN()-5,0),\">0\")=AnzSp,INDIRECT(\"Z\"&(ROW()+AnzSp+1-$A27)&\"S6\",0)>0,G27=LARGE(INDIRECT(\"Z\"&(ROW()+1-$A27&\"S\"&COLUMN()-5)&\":Z\"&(ROW()+AnzSp-$A27)&\"S\"&COLUMN()-5,0),1),COUNTIF(INDIRECT(\"Z\"&(ROW()+1-$A27&\"S\"&COLUMN()-5)&\":Z\"&(ROW())&\"S\"&COLUMN()-5,0),G27)<3),\"X\",IF(AND(COUNTIF(INDIRECT(\"Z\"&(ROW()+1-$A27&\"S\"&COLUMN()-5)&\":Z\"&(ROW()+AnzSp-$A27)&\"S\"&COLUMN()-5,0),\">0\")=AnzSp,INDIRECT(\"Z\"&(ROW()+AnzSp+1-$A27)&\"S6\",0)>0,G27=LARGE(INDIRECT(\"Z\"&(ROW()+1-$A27&\"S\"&COLUMN()-5)&\":Z\"&(ROW()+AnzSp-$A27)&\"S\"&COLUMN()-5,0),2),COUNTIF(INDIRECT(\"Z\"&(ROW()+1-$A27&\"S\"&COLUMN()-5)&\":Z\"&(ROW())&\"S\"&COLUMN()-5,0),G27)=1),\"X\",\"\"))),\"\")","v":""},{"$f":"IF(H27>0,IF(AND(COUNTIF(INDIRECT(\"Z\"&(ROW()+1-$A27&\"S\"&COLUMN()-5)&\":Z\"&(ROW()+AnzSp-$A27)&\"S\"&COLUMN()-5,0),\">0\")=AnzSp-1,H27=LARGE(INDIRECT(\"Z\"&(ROW()+1-$A27&\"S\"&COLUMN()-5)&\":Z\"&(ROW()+AnzSp-$A27)&\"S\"&COLUMN()-5,0),1),COUNTIF(INDIRECT(\"Z\"&(ROW()+1-$A27&\"S\"&COLUMN()-5)&\":Z\"&(ROW())&\"S\"&COLUMN()-5,0),H27)=1),\"X\",IF(AND(COUNTIF(INDIRECT(\"Z\"&(ROW()+1-$A27&\"S\"&COLUMN()-5)&\":Z\"&(ROW()+AnzSp-$A27)&\"S\"&COLUMN()-5,0),\">0\")=AnzSp,INDIRECT(\"Z\"&(ROW()+AnzSp+1-$A27)&\"S6\",0)>0,H27=LARGE(INDIRECT(\"Z\"&(ROW()+1-$A27&\"S\"&COLUMN()-5)&\":Z\"&(ROW()+AnzSp-$A27)&\"S\"&COLUMN()-5,0),1),COUNTIF(INDIRECT(\"Z\"&(ROW()+1-$A27&\"S\"&COLUMN()-5)&\":Z\"&(ROW())&\"S\"&COLUMN()-5,0),H27)<3),\"X\",IF(AND(COUNTIF(INDIRECT(\"Z\"&(ROW()+1-$A27&\"S\"&COLUMN()-5)&\":Z\"&(ROW()+AnzSp-$A27)&\"S\"&COLUMN()-5,0),\">0\")=AnzSp,INDIRECT(\"Z\"&(ROW()+AnzSp+1-$A27)&\"S6\",0)>0,H27=LARGE(INDIRECT(\"Z\"&(ROW()+1-$A27&\"S\"&COLUMN()-5)&\":Z\"&(ROW()+AnzSp-$A27)&\"S\"&COLUMN()-5,0),2),COUNTIF(INDIRECT(\"Z\"&(ROW()+1-$A27&\"S\"&COLUMN()-5)&\":Z\"&(ROW())&\"S\"&COLUMN()-5,0),H27)=1),\"X\",\"\"))),\"\")","v":""},{"$f":"IF(I27>0,IF(AND(COUNTIF(INDIRECT(\"Z\"&(ROW()+1-$A27&\"S\"&COLUMN()-5)&\":Z\"&(ROW()+AnzSp-$A27)&\"S\"&COLUMN()-5,0),\">0\")=AnzSp-1,I27=LARGE(INDIRECT(\"Z\"&(ROW()+1-$A27&\"S\"&COLUMN()-5)&\":Z\"&(ROW()+AnzSp-$A27)&\"S\"&COLUMN()-5,0),1),COUNTIF(INDIRECT(\"Z\"&(ROW()+1-$A27&\"S\"&COLUMN()-5)&\":Z\"&(ROW())&\"S\"&COLUMN()-5,0),I27)=1),\"X\",IF(AND(COUNTIF(INDIRECT(\"Z\"&(ROW()+1-$A27&\"S\"&COLUMN()-5)&\":Z\"&(ROW()+AnzSp-$A27)&\"S\"&COLUMN()-5,0),\">0\")=AnzSp,INDIRECT(\"Z\"&(ROW()+AnzSp+1-$A27)&\"S6\",0)>0,I27=LARGE(INDIRECT(\"Z\"&(ROW()+1-$A27&\"S\"&COLUMN()-5)&\":Z\"&(ROW()+AnzSp-$A27)&\"S\"&COLUMN()-5,0),1),COUNTIF(INDIRECT(\"Z\"&(ROW()+1-$A27&\"S\"&COLUMN()-5)&\":Z\"&(ROW())&\"S\"&COLUMN()-5,0),I27)<3),\"X\",IF(AND(COUNTIF(INDIRECT(\"Z\"&(ROW()+1-$A27&\"S\"&COLUMN()-5)&\":Z\"&(ROW()+AnzSp-$A27)&\"S\"&COLUMN()-5,0),\">0\")=AnzSp,INDIRECT(\"Z\"&(ROW()+AnzSp+1-$A27)&\"S6\",0)>0,I27=LARGE(INDIRECT(\"Z\"&(ROW()+1-$A27&\"S\"&COLUMN()-5)&\":Z\"&(ROW()+AnzSp-$A27)&\"S\"&COLUMN()-5,0),2),COUNTIF(INDIRECT(\"Z\"&(ROW()+1-$A27&\"S\"&COLUMN()-5)&\":Z\"&(ROW())&\"S\"&COLUMN()-5,0),I27)=1),\"X\",\"\"))),\"\")","v":"X"},{"$f":"IF(J27>0,IF(AND(COUNTIF(INDIRECT(\"Z\"&(ROW()+1-$A27&\"S\"&COLUMN()-5)&\":Z\"&(ROW()+AnzSp-$A27)&\"S\"&COLUMN()-5,0),\">0\")=AnzSp-1,J27=LARGE(INDIRECT(\"Z\"&(ROW()+1-$A27&\"S\"&COLUMN()-5)&\":Z\"&(ROW()+AnzSp-$A27)&\"S\"&COLUMN()-5,0),1),COUNTIF(INDIRECT(\"Z\"&(ROW()+1-$A27&\"S\"&COLUMN()-5)&\":Z\"&(ROW())&\"S\"&COLUMN()-5,0),J27)=1),\"X\",IF(AND(COUNTIF(INDIRECT(\"Z\"&(ROW()+1-$A27&\"S\"&COLUMN()-5)&\":Z\"&(ROW()+AnzSp-$A27)&\"S\"&COLUMN()-5,0),\">0\")=AnzSp,INDIRECT(\"Z\"&(ROW()+AnzSp+1-$A27)&\"S6\",0)>0,J27=LARGE(INDIRECT(\"Z\"&(ROW()+1-$A27&\"S\"&COLUMN()-5)&\":Z\"&(ROW()+AnzSp-$A27)&\"S\"&COLUMN()-5,0),1),COUNTIF(INDIRECT(\"Z\"&(ROW()+1-$A27&\"S\"&COLUMN()-5)&\":Z\"&(ROW())&\"S\"&COLUMN()-5,0),J27)<3),\"X\",IF(AND(COUNTIF(INDIRECT(\"Z\"&(ROW()+1-$A27&\"S\"&COLUMN()-5)&\":Z\"&(ROW()+AnzSp-$A27)&\"S\"&COLUMN()-5,0),\">0\")=AnzSp,INDIRECT(\"Z\"&(ROW()+AnzSp+1-$A27)&\"S6\",0)>0,J27=LARGE(INDIRECT(\"Z\"&(ROW()+1-$A27&\"S\"&COLUMN()-5)&\":Z\"&(ROW()+AnzSp-$A27)&\"S\"&COLUMN()-5,0),2),COUNTIF(INDIRECT(\"Z\"&(ROW()+1-$A27&\"S\"&COLUMN()-5)&\":Z\"&(ROW())&\"S\"&COLUMN()-5,0),J27)=1),\"X\",\"\"))),\"\")","v":"X"},{"$f":"SUM(G27:J27)","v":115}]
[3,"Lührs","Werner",null,3261,"Sm 2",{"$f":"IF(ISERROR(VLOOKUP($E28,Ergebnisse,COLUMN()-4,0)),0,VLOOKUP($E28,Ergebnisse,COLUMN()-4,0))","v":29},{"$f":"IF(ISERROR(VLOOKUP($E28,Ergebnisse,COLUMN()-4,0)),0,VLOOKUP($E28,Ergebnisse,COLUMN()-4,0))","v":31},{"$f":"IF(ISERROR(VLOOKUP($E28,Ergebnisse,COLUMN()-4,0)),0,VLOOKUP($E28,Ergebnisse,COLUMN()-4,0))","v":26},{"$f":"IF(ISERROR(VLOOKUP($E28,Ergebnisse,COLUMN()-4,0)),0,VLOOKUP($E28,Ergebnisse,COLUMN()-4,0))","v":26},81,{"$f":"IF(G28>0,IF(AND(COUNTIF(INDIRECT(\"Z\"&(ROW()+1-$A28&\"S\"&COLUMN()-5)&\":Z\"&(ROW()+AnzSp-$A28)&\"S\"&COLUMN()-5,0),\">0\")=AnzSp-1,G28=LARGE(INDIRECT(\"Z\"&(ROW()+1-$A28&\"S\"&COLUMN()-5)&\":Z\"&(ROW()+AnzSp-$A28)&\"S\"&COLUMN()-5,0),1),COUNTIF(INDIRECT(\"Z\"&(ROW()+1-$A28&\"S\"&COLUMN()-5)&\":Z\"&(ROW())&\"S\"&COLUMN()-5,0),G28)=1),\"X\",IF(AND(COUNTIF(INDIRECT(\"Z\"&(ROW()+1-$A28&\"S\"&COLUMN()-5)&\":Z\"&(ROW()+AnzSp-$A28)&\"S\"&COLUMN()-5,0),\">0\")=AnzSp,INDIRECT(\"Z\"&(ROW()+AnzSp+1-$A28)&\"S6\",0)>0,G28=LARGE(INDIRECT(\"Z\"&(ROW()+1-$A28&\"S\"&COLUMN()-5)&\":Z\"&(ROW()+AnzSp-$A28)&\"S\"&COLUMN()-5,0),1),COUNTIF(INDIRECT(\"Z\"&(ROW()+1-$A28&\"S\"&COLUMN()-5)&\":Z\"&(ROW())&\"S\"&COLUMN()-5,0),G28)<3),\"X\",IF(AND(COUNTIF(INDIRECT(\"Z\"&(ROW()+1-$A28&\"S\"&COLUMN()-5)&\":Z\"&(ROW()+AnzSp-$A28)&\"S\"&COLUMN()-5,0),\">0\")=AnzSp,INDIRECT(\"Z\"&(ROW()+AnzSp+1-$A28)&\"S6\",0)>0,G28=LARGE(INDIRECT(\"Z\"&(ROW()+1-$A28&\"S\"&COLUMN()-5)&\":Z\"&(ROW()+AnzSp-$A28)&\"S\"&COLUMN()-5,0),2),COUNTIF(INDIRECT(\"Z\"&(ROW()+1-$A28&\"S\"&COLUMN()-5)&\":Z\"&(ROW())&\"S\"&COLUMN()-5,0),G28)=1),\"X\",\"\"))),\"\")","v":""},{"$f":"IF(H28>0,IF(AND(COUNTIF(INDIRECT(\"Z\"&(ROW()+1-$A28&\"S\"&COLUMN()-5)&\":Z\"&(ROW()+AnzSp-$A28)&\"S\"&COLUMN()-5,0),\">0\")=AnzSp-1,H28=LARGE(INDIRECT(\"Z\"&(ROW()+1-$A28&\"S\"&COLUMN()-5)&\":Z\"&(ROW()+AnzSp-$A28)&\"S\"&COLUMN()-5,0),1),COUNTIF(INDIRECT(\"Z\"&(ROW()+1-$A28&\"S\"&COLUMN()-5)&\":Z\"&(ROW())&\"S\"&COLUMN()-5,0),H28)=1),\"X\",IF(AND(COUNTIF(INDIRECT(\"Z\"&(ROW()+1-$A28&\"S\"&COLUMN()-5)&\":Z\"&(ROW()+AnzSp-$A28)&\"S\"&COLUMN()-5,0),\">0\")=AnzSp,INDIRECT(\"Z\"&(ROW()+AnzSp+1-$A28)&\"S6\",0)>0,H28=LARGE(INDIRECT(\"Z\"&(ROW()+1-$A28&\"S\"&COLUMN()-5)&\":Z\"&(ROW()+AnzSp-$A28)&\"S\"&COLUMN()-5,0),1),COUNTIF(INDIRECT(\"Z\"&(ROW()+1-$A28&\"S\"&COLUMN()-5)&\":Z\"&(ROW())&\"S\"&COLUMN()-5,0),H28)<3),\"X\",IF(AND(COUNTIF(INDIRECT(\"Z\"&(ROW()+1-$A28&\"S\"&COLUMN()-5)&\":Z\"&(ROW()+AnzSp-$A28)&\"S\"&COLUMN()-5,0),\">0\")=AnzSp,INDIRECT(\"Z\"&(ROW()+AnzSp+1-$A28)&\"S6\",0)>0,H28=LARGE(INDIRECT(\"Z\"&(ROW()+1-$A28&\"S\"&COLUMN()-5)&\":Z\"&(ROW()+AnzSp-$A28)&\"S\"&COLUMN()-5,0),2),COUNTIF(INDIRECT(\"Z\"&(ROW()+1-$A28&\"S\"&COLUMN()-5)&\":Z\"&(ROW())&\"S\"&COLUMN()-5,0),H28)=1),\"X\",\"\"))),\"\")","v":"X"},{"$f":"IF(I28>0,IF(AND(COUNTIF(INDIRECT(\"Z\"&(ROW()+1-$A28&\"S\"&COLUMN()-5)&\":Z\"&(ROW()+AnzSp-$A28)&\"S\"&COLUMN()-5,0),\">0\")=AnzSp-1,I28=LARGE(INDIRECT(\"Z\"&(ROW()+1-$A28&\"S\"&COLUMN()-5)&\":Z\"&(ROW()+AnzSp-$A28)&\"S\"&COLUMN()-5,0),1),COUNTIF(INDIRECT(\"Z\"&(ROW()+1-$A28&\"S\"&COLUMN()-5)&\":Z\"&(ROW())&\"S\"&COLUMN()-5,0),I28)=1),\"X\",IF(AND(COUNTIF(INDIRECT(\"Z\"&(ROW()+1-$A28&\"S\"&COLUMN()-5)&\":Z\"&(ROW()+AnzSp-$A28)&\"S\"&COLUMN()-5,0),\">0\")=AnzSp,INDIRECT(\"Z\"&(ROW()+AnzSp+1-$A28)&\"S6\",0)>0,I28=LARGE(INDIRECT(\"Z\"&(ROW()+1-$A28&\"S\"&COLUMN()-5)&\":Z\"&(ROW()+AnzSp-$A28)&\"S\"&COLUMN()-5,0),1),COUNTIF(INDIRECT(\"Z\"&(ROW()+1-$A28&\"S\"&COLUMN()-5)&\":Z\"&(ROW())&\"S\"&COLUMN()-5,0),I28)<3),\"X\",IF(AND(COUNTIF(INDIRECT(\"Z\"&(ROW()+1-$A28&\"S\"&COLUMN()-5)&\":Z\"&(ROW()+AnzSp-$A28)&\"S\"&COLUMN()-5,0),\">0\")=AnzSp,INDIRECT(\"Z\"&(ROW()+AnzSp+1-$A28)&\"S6\",0)>0,I28=LARGE(INDIRECT(\"Z\"&(ROW()+1-$A28&\"S\"&COLUMN()-5)&\":Z\"&(ROW()+AnzSp-$A28)&\"S\"&COLUMN()-5,0),2),COUNTIF(INDIRECT(\"Z\"&(ROW()+1-$A28&\"S\"&COLUMN()-5)&\":Z\"&(ROW())&\"S\"&COLUMN()-5,0),I28)=1),\"X\",\"\"))),\"\")","v":""},{"$f":"IF(J28>0,IF(AND(COUNTIF(INDIRECT(\"Z\"&(ROW()+1-$A28&\"S\"&COLUMN()-5)&\":Z\"&(ROW()+AnzSp-$A28)&\"S\"&COLUMN()-5,0),\">0\")=AnzSp-1,J28=LARGE(INDIRECT(\"Z\"&(ROW()+1-$A28&\"S\"&COLUMN()-5)&\":Z\"&(ROW()+AnzSp-$A28)&\"S\"&COLUMN()-5,0),1),COUNTIF(INDIRECT(\"Z\"&(ROW()+1-$A28&\"S\"&COLUMN()-5)&\":Z\"&(ROW())&\"S\"&COLUMN()-5,0),J28)=1),\"X\",IF(AND(COUNTIF(INDIRECT(\"Z\"&(ROW()+1-$A28&\"S\"&COLUMN()-5)&\":Z\"&(ROW()+AnzSp-$A28)&\"S\"&COLUMN()-5,0),\">0\")=AnzSp,INDIRECT(\"Z\"&(ROW()+AnzSp+1-$A28)&\"S6\",0)>0,J28=LARGE(INDIRECT(\"Z\"&(ROW()+1-$A28&\"S\"&COLUMN()-5)&\":Z\"&(ROW()+AnzSp-$A28)&\"S\"&COLUMN()-5,0),1),COUNTIF(INDIRECT(\"Z\"&(ROW()+1-$A28&\"S\"&COLUMN()-5)&\":Z\"&(ROW())&\"S\"&COLUMN()-5,0),J28)<3),\"X\",IF(AND(COUNTIF(INDIRECT(\"Z\"&(ROW()+1-$A28&\"S\"&COLUMN()-5)&\":Z\"&(ROW()+AnzSp-$A28)&\"S\"&COLUMN()-5,0),\">0\")=AnzSp,INDIRECT(\"Z\"&(ROW()+AnzSp+1-$A28)&\"S6\",0)>0,J28=LARGE(INDIRECT(\"Z\"&(ROW()+1-$A28&\"S\"&COLUMN()-5)&\":Z\"&(ROW()+AnzSp-$A28)&\"S\"&COLUMN()-5,0),2),COUNTIF(INDIRECT(\"Z\"&(ROW()+1-$A28&\"S\"&COLUMN()-5)&\":Z\"&(ROW())&\"S\"&COLUMN()-5,0),J28)=1),\"X\",\"\"))),\"\")","v":""},112]
[4,"Prediger","Lars",null,66608,"H",{"$f":"IF(ISERROR(VLOOKUP($E29,Ergebnisse,COLUMN()-4,0)),0,VLOOKUP($E29,Ergebnisse,COLUMN()-4,0))","v":24},{"$f":"IF(ISERROR(VLOOKUP($E29,Ergebnisse,COLUMN()-4,0)),0,VLOOKUP($E29,Ergebnisse,COLUMN()-4,0))","v":23},{"$f":"IF(ISERROR(VLOOKUP($E29,Ergebnisse,COLUMN()-4,0)),0,VLOOKUP($E29,Ergebnisse,COLUMN()-4,0))","v":28},{"$f":"IF(ISERROR(VLOOKUP($E29,Ergebnisse,COLUMN()-4,0)),0,VLOOKUP($E29,Ergebnisse,COLUMN()-4,0))","v":28},103,{"$f":"IF(G29>0,IF(AND(COUNTIF(INDIRECT(\"Z\"&(ROW()+1-$A29&\"S\"&COLUMN()-5)&\":Z\"&(ROW()+AnzSp-$A29)&\"S\"&COLUMN()-5,0),\">0\")=AnzSp-1,G29=LARGE(INDIRECT(\"Z\"&(ROW()+1-$A29&\"S\"&COLUMN()-5)&\":Z\"&(ROW()+AnzSp-$A29)&\"S\"&COLUMN()-5,0),1),COUNTIF(INDIRECT(\"Z\"&(ROW()+1-$A29&\"S\"&COLUMN()-5)&\":Z\"&(ROW())&\"S\"&COLUMN()-5,0),G29)=1),\"X\",IF(AND(COUNTIF(INDIRECT(\"Z\"&(ROW()+1-$A29&\"S\"&COLUMN()-5)&\":Z\"&(ROW()+AnzSp-$A29)&\"S\"&COLUMN()-5,0),\">0\")=AnzSp,INDIRECT(\"Z\"&(ROW()+AnzSp+1-$A29)&\"S6\",0)>0,G29=LARGE(INDIRECT(\"Z\"&(ROW()+1-$A29&\"S\"&COLUMN()-5)&\":Z\"&(ROW()+AnzSp-$A29)&\"S\"&COLUMN()-5,0),1),COUNTIF(INDIRECT(\"Z\"&(ROW()+1-$A29&\"S\"&COLUMN()-5)&\":Z\"&(ROW())&\"S\"&COLUMN()-5,0),G29)<3),\"X\",IF(AND(COUNTIF(INDIRECT(\"Z\"&(ROW()+1-$A29&\"S\"&COLUMN()-5)&\":Z\"&(ROW()+AnzSp-$A29)&\"S\"&COLUMN()-5,0),\">0\")=AnzSp,INDIRECT(\"Z\"&(ROW()+AnzSp+1-$A29)&\"S6\",0)>0,G29=LARGE(INDIRECT(\"Z\"&(ROW()+1-$A29&\"S\"&COLUMN()-5)&\":Z\"&(ROW()+AnzSp-$A29)&\"S\"&COLUMN()-5,0),2),COUNTIF(INDIRECT(\"Z\"&(ROW()+1-$A29&\"S\"&COLUMN()-5)&\":Z\"&(ROW())&\"S\"&COLUMN()-5,0),G29)=1),\"X\",\"\"))),\"\")","v":""},{"$f":"IF(H29>0,IF(AND(COUNTIF(INDIRECT(\"Z\"&(ROW()+1-$A29&\"S\"&COLUMN()-5)&\":Z\"&(ROW()+AnzSp-$A29)&\"S\"&COLUMN()-5,0),\">0\")=AnzSp-1,H29=LARGE(INDIRECT(\"Z\"&(ROW()+1-$A29&\"S\"&COLUMN()-5)&\":Z\"&(ROW()+AnzSp-$A29)&\"S\"&COLUMN()-5,0),1),COUNTIF(INDIRECT(\"Z\"&(ROW()+1-$A29&\"S\"&COLUMN()-5)&\":Z\"&(ROW())&\"S\"&COLUMN()-5,0),H29)=1),\"X\",IF(AND(COUNTIF(INDIRECT(\"Z\"&(ROW()+1-$A29&\"S\"&COLUMN()-5)&\":Z\"&(ROW()+AnzSp-$A29)&\"S\"&COLUMN()-5,0),\">0\")=AnzSp,INDIRECT(\"Z\"&(ROW()+AnzSp+1-$A29)&\"S6\",0)>0,H29=LARGE(INDIRECT(\"Z\"&(ROW()+1-$A29&\"S\"&COLUMN()-5)&\":Z\"&(ROW()+AnzSp-$A29)&\"S\"&COLUMN()-5,0),1),COUNTIF(INDIRECT(\"Z\"&(ROW()+1-$A29&\"S\"&COLUMN()-5)&\":Z\"&(ROW())&\"S\"&COLUMN()-5,0),H29)<3),\"X\",IF(AND(COUNTIF(INDIRECT(\"Z\"&(ROW()+1-$A29&\"S\"&COLUMN()-5)&\":Z\"&(ROW()+AnzSp-$A29)&\"S\"&COLUMN()-5,0),\">0\")=AnzSp,INDIRECT(\"Z\"&(ROW()+AnzSp+1-$A29)&\"S6\",0)>0,H29=LARGE(INDIRECT(\"Z\"&(ROW()+1-$A29&\"S\"&COLUMN()-5)&\":Z\"&(ROW()+AnzSp-$A29)&\"S\"&COLUMN()-5,0),2),COUNTIF(INDIRECT(\"Z\"&(ROW()+1-$A29&\"S\"&COLUMN()-5)&\":Z\"&(ROW())&\"S\"&COLUMN()-5,0),H29)=1),\"X\",\"\"))),\"\")","v":""},{"$f":"IF(I29>0,IF(AND(COUNTIF(INDIRECT(\"Z\"&(ROW()+1-$A29&\"S\"&COLUMN()-5)&\":Z\"&(ROW()+AnzSp-$A29)&\"S\"&COLUMN()-5,0),\">0\")=AnzSp-1,I29=LARGE(INDIRECT(\"Z\"&(ROW()+1-$A29&\"S\"&COLUMN()-5)&\":Z\"&(ROW()+AnzSp-$A29)&\"S\"&COLUMN()-5,0),1),COUNTIF(INDIRECT(\"Z\"&(ROW()+1-$A29&\"S\"&COLUMN()-5)&\":Z\"&(ROW())&\"S\"&COLUMN()-5,0),I29)=1),\"X\",IF(AND(COUNTIF(INDIRECT(\"Z\"&(ROW()+1-$A29&\"S\"&COLUMN()-5)&\":Z\"&(ROW()+AnzSp-$A29)&\"S\"&COLUMN()-5,0),\">0\")=AnzSp,INDIRECT(\"Z\"&(ROW()+AnzSp+1-$A29)&\"S6\",0)>0,I29=LARGE(INDIRECT(\"Z\"&(ROW()+1-$A29&\"S\"&COLUMN()-5)&\":Z\"&(ROW()+AnzSp-$A29)&\"S\"&COLUMN()-5,0),1),COUNTIF(INDIRECT(\"Z\"&(ROW()+1-$A29&\"S\"&COLUMN()-5)&\":Z\"&(ROW())&\"S\"&COLUMN()-5,0),I29)<3),\"X\",IF(AND(COUNTIF(INDIRECT(\"Z\"&(ROW()+1-$A29&\"S\"&COLUMN()-5)&\":Z\"&(ROW()+AnzSp-$A29)&\"S\"&COLUMN()-5,0),\">0\")=AnzSp,INDIRECT(\"Z\"&(ROW()+AnzSp+1-$A29)&\"S6\",0)>0,I29=LARGE(INDIRECT(\"Z\"&(ROW()+1-$A29&\"S\"&COLUMN()-5)&\":Z\"&(ROW()+AnzSp-$A29)&\"S\"&COLUMN()-5,0),2),COUNTIF(INDIRECT(\"Z\"&(ROW()+1-$A29&\"S\"&COLUMN()-5)&\":Z\"&(ROW())&\"S\"&COLUMN()-5,0),I29)=1),\"X\",\"\"))),\"\")","v":""},{"$f":"IF(J29>0,IF(AND(COUNTIF(INDIRECT(\"Z\"&(ROW()+1-$A29&\"S\"&COLUMN()-5)&\":Z\"&(ROW()+AnzSp-$A29)&\"S\"&COLUMN()-5,0),\">0\")=AnzSp-1,J29=LARGE(INDIRECT(\"Z\"&(ROW()+1-$A29&\"S\"&COLUMN()-5)&\":Z\"&(ROW()+AnzSp-$A29)&\"S\"&COLUMN()-5,0),1),COUNTIF(INDIRECT(\"Z\"&(ROW()+1-$A29&\"S\"&COLUMN()-5)&\":Z\"&(ROW())&\"S\"&COLUMN()-5,0),J29)=1),\"X\",IF(AND(COUNTIF(INDIRECT(\"Z\"&(ROW()+1-$A29&\"S\"&COLUMN()-5)&\":Z\"&(ROW()+AnzSp-$A29)&\"S\"&COLUMN()-5,0),\">0\")=AnzSp,INDIRECT(\"Z\"&(ROW()+AnzSp+1-$A29)&\"S6\",0)>0,J29=LARGE(INDIRECT(\"Z\"&(ROW()+1-$A29&\"S\"&COLUMN()-5)&\":Z\"&(ROW()+AnzSp-$A29)&\"S\"&COLUMN()-5,0),1),COUNTIF(INDIRECT(\"Z\"&(ROW()+1-$A29&\"S\"&COLUMN()-5)&\":Z\"&(ROW())&\"S\"&COLUMN()-5,0),J29)<3),\"X\",IF(AND(COUNTIF(INDIRECT(\"Z\"&(ROW()+1-$A29&\"S\"&COLUMN()-5)&\":Z\"&(ROW()+AnzSp-$A29)&\"S\"&COLUMN()-5,0),\">0\")=AnzSp,INDIRECT(\"Z\"&(ROW()+AnzSp+1-$A29)&\"S6\",0)>0,J29=LARGE(INDIRECT(\"Z\"&(ROW()+1-$A29&\"S\"&COLUMN()-5)&\":Z\"&(ROW()+AnzSp-$A29)&\"S\"&COLUMN()-5,0),2),COUNTIF(INDIRECT(\"Z\"&(ROW()+1-$A29&\"S\"&COLUMN()-5)&\":Z\"&(ROW())&\"S\"&COLUMN()-5,0),J29)=1),\"X\",\"\"))),\"\")","v":""},103]
[5,"Gaute","Wolfgang",null,34092,"Sm 1",{"$f":"IF(ISERROR(VLOOKUP($E30,Ergebnisse,COLUMN()-4,0)),0,VLOOKUP($E30,Ergebnisse,COLUMN()-4,0))","v":22},{"$f":"IF(ISERROR(VLOOKUP($E30,Ergebnisse,COLUMN()-4,0)),0,VLOOKUP($E30,Ergebnisse,COLUMN()-4,0))","v":26},{"$f":"IF(ISERROR(VLOOKUP($E30,Ergebnisse,COLUMN()-4,0)),0,VLOOKUP($E30,Ergebnisse,COLUMN()-4,0))","v":24},{"$f":"IF(ISERROR(VLOOKUP($E30,Ergebnisse,COLUMN()-4,0)),0,VLOOKUP($E30,Ergebnisse,COLUMN()-4,0))","v":29},101,{"$f":"IF(G30>0,IF(AND(COUNTIF(INDIRECT(\"Z\"&(ROW()+1-$A30&\"S\"&COLUMN()-5)&\":Z\"&(ROW()+AnzSp-$A30)&\"S\"&COLUMN()-5,0),\">0\")=AnzSp-1,G30=LARGE(INDIRECT(\"Z\"&(ROW()+1-$A30&\"S\"&COLUMN()-5)&\":Z\"&(ROW()+AnzSp-$A30)&\"S\"&COLUMN()-5,0),1),COUNTIF(INDIRECT(\"Z\"&(ROW()+1-$A30&\"S\"&COLUMN()-5)&\":Z\"&(ROW())&\"S\"&COLUMN()-5,0),G30)=1),\"X\",IF(AND(COUNTIF(INDIRECT(\"Z\"&(ROW()+1-$A30&\"S\"&COLUMN()-5)&\":Z\"&(ROW()+AnzSp-$A30)&\"S\"&COLUMN()-5,0),\">0\")=AnzSp,INDIRECT(\"Z\"&(ROW()+AnzSp+1-$A30)&\"S6\",0)>0,G30=LARGE(INDIRECT(\"Z\"&(ROW()+1-$A30&\"S\"&COLUMN()-5)&\":Z\"&(ROW()+AnzSp-$A30)&\"S\"&COLUMN()-5,0),1),COUNTIF(INDIRECT(\"Z\"&(ROW()+1-$A30&\"S\"&COLUMN()-5)&\":Z\"&(ROW())&\"S\"&COLUMN()-5,0),G30)<3),\"X\",IF(AND(COUNTIF(INDIRECT(\"Z\"&(ROW()+1-$A30&\"S\"&COLUMN()-5)&\":Z\"&(ROW()+AnzSp-$A30)&\"S\"&COLUMN()-5,0),\">0\")=AnzSp,INDIRECT(\"Z\"&(ROW()+AnzSp+1-$A30)&\"S6\",0)>0,G30=LARGE(INDIRECT(\"Z\"&(ROW()+1-$A30&\"S\"&COLUMN()-5)&\":Z\"&(ROW()+AnzSp-$A30)&\"S\"&COLUMN()-5,0),2),COUNTIF(INDIRECT(\"Z\"&(ROW()+1-$A30&\"S\"&COLUMN()-5)&\":Z\"&(ROW())&\"S\"&COLUMN()-5,0),G30)=1),\"X\",\"\"))),\"\")","v":""},{"$f":"IF(H30>0,IF(AND(COUNTIF(INDIRECT(\"Z\"&(ROW()+1-$A30&\"S\"&COLUMN()-5)&\":Z\"&(ROW()+AnzSp-$A30)&\"S\"&COLUMN()-5,0),\">0\")=AnzSp-1,H30=LARGE(INDIRECT(\"Z\"&(ROW()+1-$A30&\"S\"&COLUMN()-5)&\":Z\"&(ROW()+AnzSp-$A30)&\"S\"&COLUMN()-5,0),1),COUNTIF(INDIRECT(\"Z\"&(ROW()+1-$A30&\"S\"&COLUMN()-5)&\":Z\"&(ROW())&\"S\"&COLUMN()-5,0),H30)=1),\"X\",IF(AND(COUNTIF(INDIRECT(\"Z\"&(ROW()+1-$A30&\"S\"&COLUMN()-5)&\":Z\"&(ROW()+AnzSp-$A30)&\"S\"&COLUMN()-5,0),\">0\")=AnzSp,INDIRECT(\"Z\"&(ROW()+AnzSp+1-$A30)&\"S6\",0)>0,H30=LARGE(INDIRECT(\"Z\"&(ROW()+1-$A30&\"S\"&COLUMN()-5)&\":Z\"&(ROW()+AnzSp-$A30)&\"S\"&COLUMN()-5,0),1),COUNTIF(INDIRECT(\"Z\"&(ROW()+1-$A30&\"S\"&COLUMN()-5)&\":Z\"&(ROW())&\"S\"&COLUMN()-5,0),H30)<3),\"X\",IF(AND(COUNTIF(INDIRECT(\"Z\"&(ROW()+1-$A30&\"S\"&COLUMN()-5)&\":Z\"&(ROW()+AnzSp-$A30)&\"S\"&COLUMN()-5,0),\">0\")=AnzSp,INDIRECT(\"Z\"&(ROW()+AnzSp+1-$A30)&\"S6\",0)>0,H30=LARGE(INDIRECT(\"Z\"&(ROW()+1-$A30&\"S\"&COLUMN()-5)&\":Z\"&(ROW()+AnzSp-$A30)&\"S\"&COLUMN()-5,0),2),COUNTIF(INDIRECT(\"Z\"&(ROW()+1-$A30&\"S\"&COLUMN()-5)&\":Z\"&(ROW())&\"S\"&COLUMN()-5,0),H30)=1),\"X\",\"\"))),\"\")","v":""},{"$f":"IF(I30>0,IF(AND(COUNTIF(INDIRECT(\"Z\"&(ROW()+1-$A30&\"S\"&COLUMN()-5)&\":Z\"&(ROW()+AnzSp-$A30)&\"S\"&COLUMN()-5,0),\">0\")=AnzSp-1,I30=LARGE(INDIRECT(\"Z\"&(ROW()+1-$A30&\"S\"&COLUMN()-5)&\":Z\"&(ROW()+AnzSp-$A30)&\"S\"&COLUMN()-5,0),1),COUNTIF(INDIRECT(\"Z\"&(ROW()+1-$A30&\"S\"&COLUMN()-5)&\":Z\"&(ROW())&\"S\"&COLUMN()-5,0),I30)=1),\"X\",IF(AND(COUNTIF(INDIRECT(\"Z\"&(ROW()+1-$A30&\"S\"&COLUMN()-5)&\":Z\"&(ROW()+AnzSp-$A30)&\"S\"&COLUMN()-5,0),\">0\")=AnzSp,INDIRECT(\"Z\"&(ROW()+AnzSp+1-$A30)&\"S6\",0)>0,I30=LARGE(INDIRECT(\"Z\"&(ROW()+1-$A30&\"S\"&COLUMN()-5)&\":Z\"&(ROW()+AnzSp-$A30)&\"S\"&COLUMN()-5,0),1),COUNTIF(INDIRECT(\"Z\"&(ROW()+1-$A30&\"S\"&COLUMN()-5)&\":Z\"&(ROW())&\"S\"&COLUMN()-5,0),I30)<3),\"X\",IF(AND(COUNTIF(INDIRECT(\"Z\"&(ROW()+1-$A30&\"S\"&COLUMN()-5)&\":Z\"&(ROW()+AnzSp-$A30)&\"S\"&COLUMN()-5,0),\">0\")=AnzSp,INDIRECT(\"Z\"&(ROW()+AnzSp+1-$A30)&\"S6\",0)>0,I30=LARGE(INDIRECT(\"Z\"&(ROW()+1-$A30&\"S\"&COLUMN()-5)&\":Z\"&(ROW()+AnzSp-$A30)&\"S\"&COLUMN()-5,0),2),COUNTIF(INDIRECT(\"Z\"&(ROW()+1-$A30&\"S\"&COLUMN()-5)&\":Z\"&(ROW())&\"S\"&COLUMN()-5,0),I30)=1),\"X\",\"\"))),\"\")","v":""},{"$f":"IF(J30>0,IF(AND(COUNTIF(INDIRECT(\"Z\"&(ROW()+1-$A30&\"S\"&COLUMN()-5)&\":Z\"&(ROW()+AnzSp-$A30)&\"S\"&COLUMN()-5,0),\">0\")=AnzSp-1,J30=LARGE(INDIRECT(\"Z\"&(ROW()+1-$A30&\"S\"&COLUMN()-5)&\":Z\"&(ROW()+AnzSp-$A30)&\"S\"&COLUMN()-5,0),1),COUNTIF(INDIRECT(\"Z\"&(ROW()+1-$A30&\"S\"&COLUMN()-5)&\":Z\"&(ROW())&\"S\"&COLUMN()-5,0),J30)=1),\"X\",IF(AND(COUNTIF(INDIRECT(\"Z\"&(ROW()+1-$A30&\"S\"&COLUMN()-5)&\":Z\"&(ROW()+AnzSp-$A30)&\"S\"&COLUMN()-5,0),\">0\")=AnzSp,INDIRECT(\"Z\"&(ROW()+AnzSp+1-$A30)&\"S6\",0)>0,J30=LARGE(INDIRECT(\"Z\"&(ROW()+1-$A30&\"S\"&COLUMN()-5)&\":Z\"&(ROW()+AnzSp-$A30)&\"S\"&COLUMN()-5,0),1),COUNTIF(INDIRECT(\"Z\"&(ROW()+1-$A30&\"S\"&COLUMN()-5)&\":Z\"&(ROW())&\"S\"&COLUMN()-5,0),J30)<3),\"X\",IF(AND(COUNTIF(INDIRECT(\"Z\"&(ROW()+1-$A30&\"S\"&COLUMN()-5)&\":Z\"&(ROW()+AnzSp-$A30)&\"S\"&COLUMN()-5,0),\">0\")=AnzSp,INDIRECT(\"Z\"&(ROW()+AnzSp+1-$A30)&\"S6\",0)>0,J30=LARGE(INDIRECT(\"Z\"&(ROW()+1-$A30&\"S\"&COLUMN()-5)&\":Z\"&(ROW()+AnzSp-$A30)&\"S\"&COLUMN()-5,0),2),COUNTIF(INDIRECT(\"Z\"&(ROW()+1-$A30&\"S\"&COLUMN()-5)&\":Z\"&(ROW())&\"S\"&COLUMN()-5,0),J30)=1),\"X\",\"\"))),\"\")","v":""},101]
[6,"","",null,null,"",{"$f":"IF(ISERROR(VLOOKUP($E31,Ergebnisse,COLUMN()-4,0)),0,VLOOKUP($E31,Ergebnisse,COLUMN()-4,0))","v":0},{"$f":"IF(ISERROR(VLOOKUP($E31,Ergebnisse,COLUMN()-4,0)),0,VLOOKUP($E31,Ergebnisse,COLUMN()-4,0))","v":0},{"$f":"IF(ISERROR(VLOOKUP($E31,Ergebnisse,COLUMN()-4,0)),0,VLOOKUP($E31,Ergebnisse,COLUMN()-4,0))","v":0},{"$f":"IF(ISERROR(VLOOKUP($E31,Ergebnisse,COLUMN()-4,0)),0,VLOOKUP($E31,Ergebnisse,COLUMN()-4,0))","v":0},0,{"$f":"IF(G31>0,IF(AND(COUNTIF(INDIRECT(\"Z\"&(ROW()+1-$A31&\"S\"&COLUMN()-5)&\":Z\"&(ROW()+AnzSp-$A31)&\"S\"&COLUMN()-5,0),\">0\")=AnzSp-1,G31=LARGE(INDIRECT(\"Z\"&(ROW()+1-$A31&\"S\"&COLUMN()-5)&\":Z\"&(ROW()+AnzSp-$A31)&\"S\"&COLUMN()-5,0),1),COUNTIF(INDIRECT(\"Z\"&(ROW()+1-$A31&\"S\"&COLUMN()-5)&\":Z\"&(ROW())&\"S\"&COLUMN()-5,0),G31)=1),\"X\",IF(AND(COUNTIF(INDIRECT(\"Z\"&(ROW()+1-$A31&\"S\"&COLUMN()-5)&\":Z\"&(ROW()+AnzSp-$A31)&\"S\"&COLUMN()-5,0),\">0\")=AnzSp,INDIRECT(\"Z\"&(ROW()+AnzSp+1-$A31)&\"S6\",0)>0,G31=LARGE(INDIRECT(\"Z\"&(ROW()+1-$A31&\"S\"&COLUMN()-5)&\":Z\"&(ROW()+AnzSp-$A31)&\"S\"&COLUMN()-5,0),1),COUNTIF(INDIRECT(\"Z\"&(ROW()+1-$A31&\"S\"&COLUMN()-5)&\":Z\"&(ROW())&\"S\"&COLUMN()-5,0),G31)<3),\"X\",IF(AND(COUNTIF(INDIRECT(\"Z\"&(ROW()+1-$A31&\"S\"&COLUMN()-5)&\":Z\"&(ROW()+AnzSp-$A31)&\"S\"&COLUMN()-5,0),\">0\")=AnzSp,INDIRECT(\"Z\"&(ROW()+AnzSp+1-$A31)&\"S6\",0)>0,G31=LARGE(INDIRECT(\"Z\"&(ROW()+1-$A31&\"S\"&COLUMN()-5)&\":Z\"&(ROW()+AnzSp-$A31)&\"S\"&COLUMN()-5,0),2),COUNTIF(INDIRECT(\"Z\"&(ROW()+1-$A31&\"S\"&COLUMN()-5)&\":Z\"&(ROW())&\"S\"&COLUMN()-5,0),G31)=1),\"X\",\"\"))),\"\")","v":""},{"$f":"IF(H31>0,IF(AND(COUNTIF(INDIRECT(\"Z\"&(ROW()+1-$A31&\"S\"&COLUMN()-5)&\":Z\"&(ROW()+AnzSp-$A31)&\"S\"&COLUMN()-5,0),\">0\")=AnzSp-1,H31=LARGE(INDIRECT(\"Z\"&(ROW()+1-$A31&\"S\"&COLUMN()-5)&\":Z\"&(ROW()+AnzSp-$A31)&\"S\"&COLUMN()-5,0),1),COUNTIF(INDIRECT(\"Z\"&(ROW()+1-$A31&\"S\"&COLUMN()-5)&\":Z\"&(ROW())&\"S\"&COLUMN()-5,0),H31)=1),\"X\",IF(AND(COUNTIF(INDIRECT(\"Z\"&(ROW()+1-$A31&\"S\"&COLUMN()-5)&\":Z\"&(ROW()+AnzSp-$A31)&\"S\"&COLUMN()-5,0),\">0\")=AnzSp,INDIRECT(\"Z\"&(ROW()+AnzSp+1-$A31)&\"S6\",0)>0,H31=LARGE(INDIRECT(\"Z\"&(ROW()+1-$A31&\"S\"&COLUMN()-5)&\":Z\"&(ROW()+AnzSp-$A31)&\"S\"&COLUMN()-5,0),1),COUNTIF(INDIRECT(\"Z\"&(ROW()+1-$A31&\"S\"&COLUMN()-5)&\":Z\"&(ROW())&\"S\"&COLUMN()-5,0),H31)<3),\"X\",IF(AND(COUNTIF(INDIRECT(\"Z\"&(ROW()+1-$A31&\"S\"&COLUMN()-5)&\":Z\"&(ROW()+AnzSp-$A31)&\"S\"&COLUMN()-5,0),\">0\")=AnzSp,INDIRECT(\"Z\"&(ROW()+AnzSp+1-$A31)&\"S6\",0)>0,H31=LARGE(INDIRECT(\"Z\"&(ROW()+1-$A31&\"S\"&COLUMN()-5)&\":Z\"&(ROW()+AnzSp-$A31)&\"S\"&COLUMN()-5,0),2),COUNTIF(INDIRECT(\"Z\"&(ROW()+1-$A31&\"S\"&COLUMN()-5)&\":Z\"&(ROW())&\"S\"&COLUMN()-5,0),H31)=1),\"X\",\"\"))),\"\")","v":""},{"$f":"IF(I31>0,IF(AND(COUNTIF(INDIRECT(\"Z\"&(ROW()+1-$A31&\"S\"&COLUMN()-5)&\":Z\"&(ROW()+AnzSp-$A31)&\"S\"&COLUMN()-5,0),\">0\")=AnzSp-1,I31=LARGE(INDIRECT(\"Z\"&(ROW()+1-$A31&\"S\"&COLUMN()-5)&\":Z\"&(ROW()+AnzSp-$A31)&\"S\"&COLUMN()-5,0),1),COUNTIF(INDIRECT(\"Z\"&(ROW()+1-$A31&\"S\"&COLUMN()-5)&\":Z\"&(ROW())&\"S\"&COLUMN()-5,0),I31)=1),\"X\",IF(AND(COUNTIF(INDIRECT(\"Z\"&(ROW()+1-$A31&\"S\"&COLUMN()-5)&\":Z\"&(ROW()+AnzSp-$A31)&\"S\"&COLUMN()-5,0),\">0\")=AnzSp,INDIRECT(\"Z\"&(ROW()+AnzSp+1-$A31)&\"S6\",0)>0,I31=LARGE(INDIRECT(\"Z\"&(ROW()+1-$A31&\"S\"&COLUMN()-5)&\":Z\"&(ROW()+AnzSp-$A31)&\"S\"&COLUMN()-5,0),1),COUNTIF(INDIRECT(\"Z\"&(ROW()+1-$A31&\"S\"&COLUMN()-5)&\":Z\"&(ROW())&\"S\"&COLUMN()-5,0),I31)<3),\"X\",IF(AND(COUNTIF(INDIRECT(\"Z\"&(ROW()+1-$A31&\"S\"&COLUMN()-5)&\":Z\"&(ROW()+AnzSp-$A31)&\"S\"&COLUMN()-5,0),\">0\")=AnzSp,INDIRECT(\"Z\"&(ROW()+AnzSp+1-$A31)&\"S6\",0)>0,I31=LARGE(INDIRECT(\"Z\"&(ROW()+1-$A31&\"S\"&COLUMN()-5)&\":Z\"&(ROW()+AnzSp-$A31)&\"S\"&COLUMN()-5,0),2),COUNTIF(INDIRECT(\"Z\"&(ROW()+1-$A31&\"S\"&COLUMN()-5)&\":Z\"&(ROW())&\"S\"&COLUMN()-5,0),I31)=1),\"X\",\"\"))),\"\")","v":""},{"$f":"IF(J31>0,IF(AND(COUNTIF(INDIRECT(\"Z\"&(ROW()+1-$A31&\"S\"&COLUMN()-5)&\":Z\"&(ROW()+AnzSp-$A31)&\"S\"&COLUMN()-5,0),\">0\")=AnzSp-1,J31=LARGE(INDIRECT(\"Z\"&(ROW()+1-$A31&\"S\"&COLUMN()-5)&\":Z\"&(ROW()+AnzSp-$A31)&\"S\"&COLUMN()-5,0),1),COUNTIF(INDIRECT(\"Z\"&(ROW()+1-$A31&\"S\"&COLUMN()-5)&\":Z\"&(ROW())&\"S\"&COLUMN()-5,0),J31)=1),\"X\",IF(AND(COUNTIF(INDIRECT(\"Z\"&(ROW()+1-$A31&\"S\"&COLUMN()-5)&\":Z\"&(ROW()+AnzSp-$A31)&\"S\"&COLUMN()-5,0),\">0\")=AnzSp,INDIRECT(\"Z\"&(ROW()+AnzSp+1-$A31)&\"S6\",0)>0,J31=LARGE(INDIRECT(\"Z\"&(ROW()+1-$A31&\"S\"&COLUMN()-5)&\":Z\"&(ROW()+AnzSp-$A31)&\"S\"&COLUMN()-5,0),1),COUNTIF(INDIRECT(\"Z\"&(ROW()+1-$A31&\"S\"&COLUMN()-5)&\":Z\"&(ROW())&\"S\"&COLUMN()-5,0),J31)<3),\"X\",IF(AND(COUNTIF(INDIRECT(\"Z\"&(ROW()+1-$A31&\"S\"&COLUMN()-5)&\":Z\"&(ROW()+AnzSp-$A31)&\"S\"&COLUMN()-5,0),\">0\")=AnzSp,INDIRECT(\"Z\"&(ROW()+AnzSp+1-$A31)&\"S6\",0)>0,J31=LARGE(INDIRECT(\"Z\"&(ROW()+1-$A31&\"S\"&COLUMN()-5)&\":Z\"&(ROW()+AnzSp-$A31)&\"S\"&COLUMN()-5,0),2),COUNTIF(INDIRECT(\"Z\"&(ROW()+1-$A31&\"S\"&COLUMN()-5)&\":Z\"&(ROW())&\"S\"&COLUMN()-5,0),J31)=1),\"X\",\"\"))),\"\")","v":""},0]
[null,{"$f":"IF(COUNT(INDIRECT(\"E\"&ROW()-AnzSp&\":E\"&ROW()-1))<=AnzSp-2,\"Kein Streicher\",IF(COUNT(INDIRECT(\"E\"&ROW()-AnzSp&\":E\"&ROW()-1))<=AnzSp-1,\"1 Streicher\",IF(AND(COUNT(INDIRECT(\"E\"&ROW()-AnzSp&\":E\"&ROW()-1))<=AnzSp,F32>0),\"2 Streicher\",\"Spieler Nr. \"&AnzSp&\" löschen und als Einzelspieler erfassen!\")))","v":"1 Streicher"},null,null,null,{"$f":"COUNTIF(INDIRECT(\"F\"&(ROW()-AnzSp)&\":F\"&ROW()-1),\"Jw\")+COUNTIF(INDIRECT(\"F\"&ROW()-AnzSp&\":F\"&ROW()-1),\"Jm\")+COUNTIF(INDIRECT(\"F\"&ROW()-AnzSp&\":F\"&ROW()-1),\"Schw\")+COUNTIF(INDIRECT(\"F\"&ROW()-AnzSp&\":F\"&ROW()-1),\"Schm\")","v":0},{"$f":"IF(COUNTIF(INDIRECT(\"G\"&ROW()-AnzSp&\":G\"&ROW()-1),\">0\")=AnzSp-2,SUM(INDIRECT(\"G\"&ROW()-AnzSp&\":G\"&ROW()-1)),IF(COUNTIF(INDIRECT(\"G\"&ROW()-AnzSp&\":G\"&ROW()-1),\">0\")=AnzSp-1,SUM(INDIRECT(\"G\"&ROW()-AnzSp&\":G\"&ROW()-1))-LARGE(INDIRECT(\"G\"&ROW()-AnzSp&\":G\"&ROW()-1),1),IF(COUNTIF(INDIRECT(\"G\"&ROW()-AnzSp&\":G\"&ROW()-1),\">0\")=AnzSp,SUM(INDIRECT(\"G\"&ROW()-AnzSp&\":G\"&ROW()-1))-LARGE(INDIRECT(\"G\"&ROW()-AnzSp&\":G\"&ROW()-1),1)-LARGE(INDIRECT(\"G\"&ROW()-AnzSp&\":G\"&ROW()-1),2),0)))","v":102},{"$f":"IF(COUNTIF(INDIRECT(\"H\"&ROW()-AnzSp&\":H\"&ROW()-1),\">0\")=AnzSp-2,SUM(INDIRECT(\"H\"&ROW()-AnzSp&\":H\"&ROW()-1)),IF(COUNTIF(INDIRECT(\"H\"&ROW()-AnzSp&\":H\"&ROW()-1),\">0\")=AnzSp-1,SUM(INDIRECT(\"H\"&ROW()-AnzSp&\":H\"&ROW()-1))-LARGE(INDIRECT(\"H\"&ROW()-AnzSp&\":H\"&ROW()-1),1),IF(COUNTIF(INDIRECT(\"H\"&ROW()-AnzSp&\":H\"&ROW()-1),\">0\")=AnzSp,SUM(INDIRECT(\"H\"&ROW()-AnzSp&\":H\"&ROW()-1))-LARGE(INDIRECT(\"H\"&ROW()-AnzSp&\":H\"&ROW()-1),1)-LARGE(INDIRECT(\"H\"&ROW()-AnzSp&\":H\"&ROW()-1),2),0)))","v":101},{"$f":"IF(COUNTIF(INDIRECT(\"I\"&ROW()-AnzSp&\":I\"&ROW()-1),\">0\")=AnzSp-2,SUM(INDIRECT(\"I\"&ROW()-AnzSp&\":I\"&ROW()-1)),IF(COUNTIF(INDIRECT(\"I\"&ROW()-AnzSp&\":I\"&ROW()-1),\">0\")=AnzSp-1,SUM(INDIRECT(\"I\"&ROW()-AnzSp&\":I\"&ROW()-1))-LARGE(INDIRECT(\"I\"&ROW()-AnzSp&\":I\"&ROW()-1),1),IF(COUNTIF(INDIRECT(\"I\"&ROW()-AnzSp&\":I\"&ROW()-1),\">0\")=AnzSp,SUM(INDIRECT(\"I\"&ROW()-AnzSp&\":I\"&ROW()-1))-LARGE(INDIRECT(\"I\"&ROW()-AnzSp&\":I\"&ROW()-1),1)-LARGE(INDIRECT(\"I\"&ROW()-AnzSp&\":I\"&ROW()-1),2),0)))","v":104},{"$f":"IF(COUNTIF(INDIRECT(\"J\"&ROW()-AnzSp&\":J\"&ROW()-1),\">0\")=AnzSp-2,SUM(INDIRECT(\"J\"&ROW()-AnzSp&\":J\"&ROW()-1)),IF(COUNTIF(INDIRECT(\"J\"&ROW()-AnzSp&\":J\"&ROW()-1),\">0\")=AnzSp-1,SUM(INDIRECT(\"J\"&ROW()-AnzSp&\":J\"&ROW()-1))-LARGE(INDIRECT(\"J\"&ROW()-AnzSp&\":J\"&ROW()-1),1),IF(COUNTIF(INDIRECT(\"J\"&ROW()-AnzSp&\":J\"&ROW()-1),\">0\")=AnzSp,SUM(INDIRECT(\"J\"&ROW()-AnzSp&\":J\"&ROW()-1))-LARGE(INDIRECT(\"J\"&ROW()-AnzSp&\":J\"&ROW()-1),1)-LARGE(INDIRECT(\"J\"&ROW()-AnzSp&\":J\"&ROW()-1),2),0)))","v":112},{"$f":"SUM(G32:J32)","v":419}]
[]
[4,"MC \"Möve\" Cuxhaven III",null,null,null,null,null,null,"Schnitt:",{"$f":"IF(COUNTIF(INDIRECT(\"G\"&ROW()+2&\":J\"&ROW()+AnzSp+1),\">0\")>0,K42/(COUNTIF(INDIRECT(\"G\"&ROW()+2&\":J\"&ROW()+AnzSp+1),\">0\")-COUNTIF(INDIRECT(\"L\"&ROW()+2&\":O\"&ROW()+AnzSp+1),\"X\")),0)","v":26.4375}]
["Nr.:","Nachname","Vorname",null,"Sp.Nr.","Kat.","R1","R2","R3","R4","Wertung",null,null,null,null,"Gesamt"]
[1,{"$f":"IF(E36=\"\",\"\",IF(ISERROR(VLOOKUP(E36,Spieler,4,0)),\"Falsche Nummer!\",VLOOKUP(E36,Spieler,4,0)))","v":"Wendlandt"},{"$f":"IF(ISERROR(VLOOKUP(E36,Spieler,3,0)),\"\",VLOOKUP(E36,Spieler,3,0))","v":"Dieter"},null,49256,{"$f":"IF(ISERROR(VLOOKUP(E36,Spieler,2,0)),\"\",VLOOKUP(E36,Spieler,2,0))","v":"Sm 1"},{"$f":"IF(ISERROR(VLOOKUP($E36,Ergebnisse,COLUMN()-4,0)),0,VLOOKUP($E36,Ergebnisse,COLUMN()-4,0))","v":30},29,22,26,{"$f":"IF(L36=\"X\",0,G36)+IF(M36=\"X\",0,H36)+IF(N36=\"X\",0,I36)+IF(O36=\"X\",0,J36)","v":107},{"$f":"IF(G36>0,IF(AND(COUNTIF(INDIRECT(\"Z\"&(ROW()+1-$A36&\"S\"&COLUMN()-5)&\":Z\"&(ROW()+AnzSp-$A36)&\"S\"&COLUMN()-5,0),\">0\")=AnzSp-1,G36=LARGE(INDIRECT(\"Z\"&(ROW()+1-$A36&\"S\"&COLUMN()-5)&\":Z\"&(ROW()+AnzSp-$A36)&\"S\"&COLUMN()-5,0),1),COUNTIF(INDIRECT(\"Z\"&(ROW()+1-$A36&\"S\"&COLUMN()-5)&\":Z\"&(ROW())&\"S\"&COLUMN()-5,0),G36)=1),\"X\",IF(AND(COUNTIF(INDIRECT(\"Z\"&(ROW()+1-$A36&\"S\"&COLUMN()-5)&\":Z\"&(ROW()+AnzSp-$A36)&\"S\"&COLUMN()-5,0),\">0\")=AnzSp,INDIRECT(\"Z\"&(ROW()+AnzSp+1-$A36)&\"S6\",0)>0,G36=LARGE(INDIRECT(\"Z\"&(ROW()+1-$A36&\"S\"&COLUMN()-5)&\":Z\"&(ROW()+AnzSp-$A36)&\"S\"&COLUMN()-5,0),1),COUNTIF(INDIRECT(\"Z\"&(ROW()+1-$A36&\"S\"&COLUMN()-5)&\":Z\"&(ROW())&\"S\"&COLUMN()-5,0),G36)<3),\"X\",IF(AND(COUNTIF(INDIRECT(\"Z\"&(ROW()+1-$A36&\"S\"&COLUMN()-5)&\":Z\"&(ROW()+AnzSp-$A36)&\"S\"&COLUMN()-5,0),\">0\")=AnzSp,INDIRECT(\"Z\"&(ROW()+AnzSp+1-$A36)&\"S6\",0)>0,G36=LARGE(INDIRECT(\"Z\"&(ROW()+1-$A36&\"S\"&COLUMN()-5)&\":Z\"&(ROW()+AnzSp-$A36)&\"S\"&COLUMN()-5,0),2),COUNTIF(INDIRECT(\"Z\"&(ROW()+1-$A36&\"S\"&COLUMN()-5)&\":Z\"&(ROW())&\"S\"&COLUMN()-5,0),G36)=1),\"X\",\"\"))),\"\")","v":""},{"$f":"IF(H36>0,IF(AND(COUNTIF(INDIRECT(\"Z\"&(ROW()+1-$A36&\"S\"&COLUMN()-5)&\":Z\"&(ROW()+AnzSp-$A36)&\"S\"&COLUMN()-5,0),\">0\")=AnzSp-1,H36=LARGE(INDIRECT(\"Z\"&(ROW()+1-$A36&\"S\"&COLUMN()-5)&\":Z\"&(ROW()+AnzSp-$A36)&\"S\"&COLUMN()-5,0),1),COUNTIF(INDIRECT(\"Z\"&(ROW()+1-$A36&\"S\"&COLUMN()-5)&\":Z\"&(ROW())&\"S\"&COLUMN()-5,0),H36)=1),\"X\",IF(AND(COUNTIF(INDIRECT(\"Z\"&(ROW()+1-$A36&\"S\"&COLUMN()-5)&\":Z\"&(ROW()+AnzSp-$A36)&\"S\"&COLUMN()-5,0),\">0\")=AnzSp,INDIRECT(\"Z\"&(ROW()+AnzSp+1-$A36)&\"S6\",0)>0,H36=LARGE(INDIRECT(\"Z\"&(ROW()+1-$A36&\"S\"&COLUMN()-5)&\":Z\"&(ROW()+AnzSp-$A36)&\"S\"&COLUMN()-5,0),1),COUNTIF(INDIRECT(\"Z\"&(ROW()+1-$A36&\"S\"&COLUMN()-5)&\":Z\"&(ROW())&\"S\"&COLUMN()-5,0),H36)<3),\"X\",IF(AND(COUNTIF(INDIRECT(\"Z\"&(ROW()+1-$A36&\"S\"&COLUMN()-5)&\":Z\"&(ROW()+AnzSp-$A36)&\"S\"&COLUMN()-5,0),\">0\")=AnzSp,INDIRECT(\"Z\"&(ROW()+AnzSp+1-$A36)&\"S6\",0)>0,H36=LARGE(INDIRECT(\"Z\"&(ROW()+1-$A36&\"S\"&COLUMN()-5)&\":Z\"&(ROW()+AnzSp-$A36)&\"S\"&COLUMN()-5,0),2),COUNTIF(INDIRECT(\"Z\"&(ROW()+1-$A36&\"S\"&COLUMN()-5)&\":Z\"&(ROW())&\"S\"&COLUMN()-5,0),H36)=1),\"X\",\"\"))),\"\")","v":""},{"$f":"IF(I36>0,IF(AND(COUNTIF(INDIRECT(\"Z\"&(ROW()+1-$A36&\"S\"&COLUMN()-5)&\":Z\"&(ROW()+AnzSp-$A36)&\"S\"&COLUMN()-5,0),\">0\")=AnzSp-1,I36=LARGE(INDIRECT(\"Z\"&(ROW()+1-$A36&\"S\"&COLUMN()-5)&\":Z\"&(ROW()+AnzSp-$A36)&\"S\"&COLUMN()-5,0),1),COUNTIF(INDIRECT(\"Z\"&(ROW()+1-$A36&\"S\"&COLUMN()-5)&\":Z\"&(ROW())&\"S\"&COLUMN()-5,0),I36)=1),\"X\",IF(AND(COUNTIF(INDIRECT(\"Z\"&(ROW()+1-$A36&\"S\"&COLUMN()-5)&\":Z\"&(ROW()+AnzSp-$A36)&\"S\"&COLUMN()-5,0),\">0\")=AnzSp,INDIRECT(\"Z\"&(ROW()+AnzSp+1-$A36)&\"S6\",0)>0,I36=LARGE(INDIRECT(\"Z\"&(ROW()+1-$A36&\"S\"&COLUMN()-5)&\":Z\"&(ROW()+AnzSp-$A36)&\"S\"&COLUMN()-5,0),1),COUNTIF(INDIRECT(\"Z\"&(ROW()+1-$A36&\"S\"&COLUMN()-5)&\":Z\"&(ROW())&\"S\"&COLUMN()-5,0),I36)<3),\"X\",IF(AND(COUNTIF(INDIRECT(\"Z\"&(ROW()+1-$A36&\"S\"&COLUMN()-5)&\":Z\"&(ROW()+AnzSp-$A36)&\"S\"&COLUMN()-5,0),\">0\")=AnzSp,INDIRECT(\"Z\"&(ROW()+AnzSp+1-$A36)&\"S6\",0)>0,I36=LARGE(INDIRECT(\"Z\"&(ROW()+1-$A36&\"S\"&COLUMN()-5)&\":Z\"&(ROW()+AnzSp-$A36)&\"S\"&COLUMN()-5,0),2),COUNTIF(INDIRECT(\"Z\"&(ROW()+1-$A36&\"S\"&COLUMN()-5)&\":Z\"&(ROW())&\"S\"&COLUMN()-5,0),I36)=1),\"X\",\"\"))),\"\")","v":""},{"$f":"IF(J36>0,IF(AND(COUNTIF(INDIRECT(\"Z\"&(ROW()+1-$A36&\"S\"&COLUMN()-5)&\":Z\"&(ROW()+AnzSp-$A36)&\"S\"&COLUMN()-5,0),\">0\")=AnzSp-1,J36=LARGE(INDIRECT(\"Z\"&(ROW()+1-$A36&\"S\"&COLUMN()-5)&\":Z\"&(ROW()+AnzSp-$A36)&\"S\"&COLUMN()-5,0),1),COUNTIF(INDIRECT(\"Z\"&(ROW()+1-$A36&\"S\"&COLUMN()-5)&\":Z\"&(ROW())&\"S\"&COLUMN()-5,0),J36)=1),\"X\",IF(AND(COUNTIF(INDIRECT(\"Z\"&(ROW()+1-$A36&\"S\"&COLUMN()-5)&\":Z\"&(ROW()+AnzSp-$A36)&\"S\"&COLUMN()-5,0),\">0\")=AnzSp,INDIRECT(\"Z\"&(ROW()+AnzSp+1-$A36)&\"S6\",0)>0,J36=LARGE(INDIRECT(\"Z\"&(ROW()+1-$A36&\"S\"&COLUMN()-5)&\":Z\"&(ROW()+AnzSp-$A36)&\"S\"&COLUMN()-5,0),1),COUNTIF(INDIRECT(\"Z\"&(ROW()+1-$A36&\"S\"&COLUMN()-5)&\":Z\"&(ROW())&\"S\"&COLUMN()-5,0),J36)<3),\"X\",IF(AND(COUNTIF(INDIRECT(\"Z\"&(ROW()+1-$A36&\"S\"&COLUMN()-5)&\":Z\"&(ROW()+AnzSp-$A36)&\"S\"&COLUMN()-5,0),\">0\")=AnzSp,INDIRECT(\"Z\"&(ROW()+AnzSp+1-$A36)&\"S6\",0)>0,J36=LARGE(INDIRECT(\"Z\"&(ROW()+1-$A36&\"S\"&COLUMN()-5)&\":Z\"&(ROW()+AnzSp-$A36)&\"S\"&COLUMN()-5,0),2),COUNTIF(INDIRECT(\"Z\"&(ROW()+1-$A36&\"S\"&COLUMN()-5)&\":Z\"&(ROW())&\"S\"&COLUMN()-5,0),J36)=1),\"X\",\"\"))),\"\")","v":""},{"$f":"SUM(G36:J36)","v":107}]
[2,"Schwarz","Detlef",null,49255,"Sm 2",25,30,27,25,77,"","X","","",{"$f":"SUM(G37:J37)","v":107}]
[3,"Symanzyk","Daniela",null,31988,"D",26,29,29,31,84,"","","","X",115]
[4,"Reinicke","Frank",null,42691,"Sm 2",33,25,31,26,51,"X","","X","",115]
[5,"Beier","Christian",null,66569,"Sm 2",30,22,24,28,104,"","","","",104]
[6,"","",null,null,"",0,0,0,0,0,"","","","",0]
[null,{"$f":"IF(COUNT(INDIRECT(\"E\"&ROW()-AnzSp&\":E\"&ROW()-1))<=AnzSp-2,\"Kein Streicher\",IF(COUNT(INDIRECT(\"E\"&ROW()-AnzSp&\":E\"&ROW()-1))<=AnzSp-1,\"1 Streicher\",IF(AND(COUNT(INDIRECT(\"E\"&ROW()-AnzSp&\":E\"&ROW()-1))<=AnzSp,F42>0),\"2 Streicher\",\"Spieler Nr. \"&AnzSp&\" löschen und als Einzelspieler erfassen!\")))","v":"1 Streicher"},null,null,null,{"$f":"COUNTIF(INDIRECT(\"F\"&(ROW()-AnzSp)&\":F\"&ROW()-1),\"Jw\")+COUNTIF(INDIRECT(\"F\"&ROW()-AnzSp&\":F\"&ROW()-1),\"Jm\")+COUNTIF(INDIRECT(\"F\"&ROW()-AnzSp&\":F\"&ROW()-1),\"Schw\")+COUNTIF(INDIRECT(\"F\"&ROW()-AnzSp&\":F\"&ROW()-1),\"Schm\")","v":0},{"$f":"IF(COUNTIF(INDIRECT(\"G\"&ROW()-AnzSp&\":G\"&ROW()-1),\">0\")=AnzSp-2,SUM(INDIRECT(\"G\"&ROW()-AnzSp&\":G\"&ROW()-1)),IF(COUNTIF(INDIRECT(\"G\"&ROW()-AnzSp&\":G\"&ROW()-1),\">0\")=AnzSp-1,SUM(INDIRECT(\"G\"&ROW()-AnzSp&\":G\"&ROW()-1))-LARGE(INDIRECT(\"G\"&ROW()-AnzSp&\":G\"&ROW()-1),1),IF(COUNTIF(INDIRECT(\"G\"&ROW()-AnzSp&\":G\"&ROW()-1),\">0\")=AnzSp,SUM(INDIRECT(\"G\"&ROW()-AnzSp&\":G\"&ROW()-1))-LARGE(INDIRECT(\"G\"&ROW()-AnzSp&\":G\"&ROW()-1),1)-LARGE(INDIRECT(\"G\"&ROW()-AnzSp&\":G\"&ROW()-1),2),0)))","v":111},{"$f":"IF(COUNTIF(INDIRECT(\"H\"&ROW()-AnzSp&\":H\"&ROW()-1),\">0\")=AnzSp-2,SUM(INDIRECT(\"H\"&ROW()-AnzSp&\":H\"&ROW()-1)),IF(COUNTIF(INDIRECT(\"H\"&ROW()-AnzSp&\":H\"&ROW()-1),\">0\")=AnzSp-1,SUM(INDIRECT(\"H\"&ROW()-AnzSp&\":H\"&ROW()-1))-LARGE(INDIRECT(\"H\"&ROW()-AnzSp&\":H\"&ROW()-1),1),IF(COUNTIF(INDIRECT(\"H\"&ROW()-AnzSp&\":H\"&ROW()-1),\">0\")=AnzSp,SUM(INDIRECT(\"H\"&ROW()-AnzSp&\":H\"&ROW()-1))-LARGE(INDIRECT(\"H\"&ROW()-AnzSp&\":H\"&ROW()-1),1)-LARGE(INDIRECT(\"H\"&ROW()-AnzSp&\":H\"&ROW()-1),2),0)))","v":105},{"$f":"IF(COUNTIF(INDIRECT(\"I\"&ROW()-AnzSp&\":I\"&ROW()-1),\">0\")=AnzSp-2,SUM(INDIRECT(\"I\"&ROW()-AnzSp&\":I\"&ROW()-1)),IF(COUNTIF(INDIRECT(\"I\"&ROW()-AnzSp&\":I\"&ROW()-1),\">0\")=AnzSp-1,SUM(INDIRECT(\"I\"&ROW()-AnzSp&\":I\"&ROW()-1))-LARGE(INDIRECT(\"I\"&ROW()-AnzSp&\":I\"&ROW()-1),1),IF(COUNTIF(INDIRECT(\"I\"&ROW()-AnzSp&\":I\"&ROW()-1),\">0\")=AnzSp,SUM(INDIRECT(\"I\"&ROW()-AnzSp&\":I\"&ROW()-1))-LARGE(INDIRECT(\"I\"&ROW()-AnzSp&\":I\"&ROW()-1),1)-LARGE(INDIRECT(\"I\"&ROW()-AnzSp&\":I\"&ROW()-1),2),0)))","v":102},{"$f":"IF(COUNTIF(INDIRECT(\"J\"&ROW()-AnzSp&\":J\"&ROW()-1),\">0\")=AnzSp-2,SUM(INDIRECT(\"J\"&ROW()-AnzSp&\":J\"&ROW()-1)),IF(COUNTIF(INDIRECT(\"J\"&ROW()-AnzSp&\":J\"&ROW()-1),\">0\")=AnzSp-1,SUM(INDIRECT(\"J\"&ROW()-AnzSp&\":J\"&ROW()-1))-LARGE(INDIRECT(\"J\"&ROW()-AnzSp&\":J\"&ROW()-1),1),IF(COUNTIF(INDIRECT(\"J\"&ROW()-AnzSp&\":J\"&ROW()-1),\">0\")=AnzSp,SUM(INDIRECT(\"J\"&ROW()-AnzSp&\":J\"&ROW()-1))-LARGE(INDIRECT(\"J\"&ROW()-AnzSp&\":J\"&ROW()-1),1)-LARGE(INDIRECT(\"J\"&ROW()-AnzSp&\":J\"&ROW()-1),2),0)))","v":105},{"$f":"SUM(G42:J42)","v":423}]
[]
[5,"BGC Diepholz II",null,null,null,null,null,null,"Schnitt:",{"$f":"IF(COUNTIF(INDIRECT(\"G\"&ROW()+2&\":J\"&ROW()+AnzSp+1),\">0\")>0,K52/(COUNTIF(INDIRECT(\"G\"&ROW()+2&\":J\"&ROW()+AnzSp+1),\">0\")-COUNTIF(INDIRECT(\"L\"&ROW()+2&\":O\"&ROW()+AnzSp+1),\"X\")),0)","v":27.4375}]
["Nr.:","Nachname","Vorname",null,"Sp.Nr.","Kat.","R1","R2","R3","R4","Wertung",null,null,null,null,"Gesamt"]
[1,{"$f":"IF(E46=\"\",\"\",IF(ISERROR(VLOOKUP(E46,Spieler,4,0)),\"Falsche Nummer!\",VLOOKUP(E46,Spieler,4,0)))","v":"Hunte"},{"$f":"IF(ISERROR(VLOOKUP(E46,Spieler,3,0)),\"\",VLOOKUP(E46,Spieler,3,0))","v":"Karl-Heinz"},null,44723,{"$f":"IF(ISERROR(VLOOKUP(E46,Spieler,2,0)),\"\",VLOOKUP(E46,Spieler,2,0))","v":"Sm 1"},{"$f":"IF(ISERROR(VLOOKUP($E46,Ergebnisse,COLUMN()-4,0)),0,VLOOKUP($E46,Ergebnisse,COLUMN()-4,0))","v":35},28,28,31,{"$f":"IF(L46=\"X\",0,G46)+IF(M46=\"X\",0,H46)+IF(N46=\"X\",0,I46)+IF(O46=\"X\",0,J46)","v":87},{"$f":"IF(G46>0,IF(AND(COUNTIF(INDIRECT(\"Z\"&(ROW()+1-$A46&\"S\"&COLUMN()-5)&\":Z\"&(ROW()+AnzSp-$A46)&\"S\"&COLUMN()-5,0),\">0\")=AnzSp-1,G46=LARGE(INDIRECT(\"Z\"&(ROW()+1-$A46&\"S\"&COLUMN()-5)&\":Z\"&(ROW()+AnzSp-$A46)&\"S\"&COLUMN()-5,0),1),COUNTIF(INDIRECT(\"Z\"&(ROW()+1-$A46&\"S\"&COLUMN()-5)&\":Z\"&(ROW())&\"S\"&COLUMN()-5,0),G46)=1),\"X\",IF(AND(COUNTIF(INDIRECT(\"Z\"&(ROW()+1-$A46&\"S\"&COLUMN()-5)&\":Z\"&(ROW()+AnzSp-$A46)&\"S\"&COLUMN()-5,0),\">0\")=AnzSp,INDIRECT(\"Z\"&(ROW()+AnzSp+1-$A46)&\"S6\",0)>0,G46=LARGE(INDIRECT(\"Z\"&(ROW()+1-$A46&\"S\"&COLUMN()-5)&\":Z\"&(ROW()+AnzSp-$A46)&\"S\"&COLUMN()-5,0),1),COUNTIF(INDIRECT(\"Z\"&(ROW()+1-$A46&\"S\"&COLUMN()-5)&\":Z\"&(ROW())&\"S\"&COLUMN()-5,0),G46)<3),\"X\",IF(AND(COUNTIF(INDIRECT(\"Z\"&(ROW()+1-$A46&\"S\"&COLUMN()-5)&\":Z\"&(ROW()+AnzSp-$A46)&\"S\"&COLUMN()-5,0),\">0\")=AnzSp,INDIRECT(\"Z\"&(ROW()+AnzSp+1-$A46)&\"S6\",0)>0,G46=LARGE(INDIRECT(\"Z\"&(ROW()+1-$A46&\"S\"&COLUMN()-5)&\":Z\"&(ROW()+AnzSp-$A46)&\"S\"&COLUMN()-5,0),2),COUNTIF(INDIRECT(\"Z\"&(ROW()+1-$A46&\"S\"&COLUMN()-5)&\":Z\"&(ROW())&\"S\"&COLUMN()-5,0),G46)=1),\"X\",\"\"))),\"\")","v":"X"},{"$f":"IF(H46>0,IF(AND(COUNTIF(INDIRECT(\"Z\"&(ROW()+1-$A46&\"S\"&COLUMN()-5)&\":Z\"&(ROW()+AnzSp-$A46)&\"S\"&COLUMN()-5,0),\">0\")=AnzSp-1,H46=LARGE(INDIRECT(\"Z\"&(ROW()+1-$A46&\"S\"&COLUMN()-5)&\":Z\"&(ROW()+AnzSp-$A46)&\"S\"&COLUMN()-5,0),1),COUNTIF(INDIRECT(\"Z\"&(ROW()+1-$A46&\"S\"&COLUMN()-5)&\":Z\"&(ROW())&\"S\"&COLUMN()-5,0),H46)=1),\"X\",IF(AND(COUNTIF(INDIRECT(\"Z\"&(ROW()+1-$A46&\"S\"&COLUMN()-5)&\":Z\"&(ROW()+AnzSp-$A46)&\"S\"&COLUMN()-5,0),\">0\")=AnzSp,INDIRECT(\"Z\"&(ROW()+AnzSp+1-$A46)&\"S6\",0)>0,H46=LARGE(INDIRECT(\"Z\"&(ROW()+1-$A46&\"S\"&COLUMN()-5)&\":Z\"&(ROW()+AnzSp-$A46)&\"S\"&COLUMN()-5,0),1),COUNTIF(INDIRECT(\"Z\"&(ROW()+1-$A46&\"S\"&COLUMN()-5)&\":Z\"&(ROW())&\"S\"&COLUMN()-5,0),H46)<3),\"X\",IF(AND(COUNTIF(INDIRECT(\"Z\"&(ROW()+1-$A46&\"S\"&COLUMN()-5)&\":Z\"&(ROW()+AnzSp-$A46)&\"S\"&COLUMN()-5,0),\">0\")=AnzSp,INDIRECT(\"Z\"&(ROW()+AnzSp+1-$A46)&\"S6\",0)>0,H46=LARGE(INDIRECT(\"Z\"&(ROW()+1-$A46&\"S\"&COLUMN()-5)&\":Z\"&(ROW()+AnzSp-$A46)&\"S\"&COLUMN()-5,0),2),COUNTIF(INDIRECT(\"Z\"&(ROW()+1-$A46&\"S\"&COLUMN()-5)&\":Z\"&(ROW())&\"S\"&COLUMN()-5,0),H46)=1),\"X\",\"\"))),\"\")","v":""},{"$f":"IF(I46>0,IF(AND(COUNTIF(INDIRECT(\"Z\"&(ROW()+1-$A46&\"S\"&COLUMN()-5)&\":Z\"&(ROW()+AnzSp-$A46)&\"S\"&COLUMN()-5,0),\">0\")=AnzSp-1,I46=LARGE(INDIRECT(\"Z\"&(ROW()+1-$A46&\"S\"&COLUMN()-5)&\":Z\"&(ROW()+AnzSp-$A46)&\"S\"&COLUMN()-5,0),1),COUNTIF(INDIRECT(\"Z\"&(ROW()+1-$A46&\"S\"&COLUMN()-5)&\":Z\"&(ROW())&\"S\"&COLUMN()-5,0),I46)=1),\"X\",IF(AND(COUNTIF(INDIRECT(\"Z\"&(ROW()+1-$A46&\"S\"&COLUMN()-5)&\":Z\"&(ROW()+AnzSp-$A46)&\"S\"&COLUMN()-5,0),\">0\")=AnzSp,INDIRECT(\"Z\"&(ROW()+AnzSp+1-$A46)&\"S6\",0)>0,I46=LARGE(INDIRECT(\"Z\"&(ROW()+1-$A46&\"S\"&COLUMN()-5)&\":Z\"&(ROW()+AnzSp-$A46)&\"S\"&COLUMN()-5,0),1),COUNTIF(INDIRECT(\"Z\"&(ROW()+1-$A46&\"S\"&COLUMN()-5)&\":Z\"&(ROW())&\"S\"&COLUMN()-5,0),I46)<3),\"X\",IF(AND(COUNTIF(INDIRECT(\"Z\"&(ROW()+1-$A46&\"S\"&COLUMN()-5)&\":Z\"&(ROW()+AnzSp-$A46)&\"S\"&COLUMN()-5,0),\">0\")=AnzSp,INDIRECT(\"Z\"&(ROW()+AnzSp+1-$A46)&\"S6\",0)>0,I46=LARGE(INDIRECT(\"Z\"&(ROW()+1-$A46&\"S\"&COLUMN()-5)&\":Z\"&(ROW()+AnzSp-$A46)&\"S\"&COLUMN()-5,0),2),COUNTIF(INDIRECT(\"Z\"&(ROW()+1-$A46&\"S\"&COLUMN()-5)&\":Z\"&(ROW())&\"S\"&COLUMN()-5,0),I46)=1),\"X\",\"\"))),\"\")","v":""},{"$f":"IF(J46>0,IF(AND(COUNTIF(INDIRECT(\"Z\"&(ROW()+1-$A46&\"S\"&COLUMN()-5)&\":Z\"&(ROW()+AnzSp-$A46)&\"S\"&COLUMN()-5,0),\">0\")=AnzSp-1,J46=LARGE(INDIRECT(\"Z\"&(ROW()+1-$A46&\"S\"&COLUMN()-5)&\":Z\"&(ROW()+AnzSp-$A46)&\"S\"&COLUMN()-5,0),1),COUNTIF(INDIRECT(\"Z\"&(ROW()+1-$A46&\"S\"&COLUMN()-5)&\":Z\"&(ROW())&\"S\"&COLUMN()-5,0),J46)=1),\"X\",IF(AND(COUNTIF(INDIRECT(\"Z\"&(ROW()+1-$A46&\"S\"&COLUMN()-5)&\":Z\"&(ROW()+AnzSp-$A46)&\"S\"&COLUMN()-5,0),\">0\")=AnzSp,INDIRECT(\"Z\"&(ROW()+AnzSp+1-$A46)&\"S6\",0)>0,J46=LARGE(INDIRECT(\"Z\"&(ROW()+1-$A46&\"S\"&COLUMN()-5)&\":Z\"&(ROW()+AnzSp-$A46)&\"S\"&COLUMN()-5,0),1),COUNTIF(INDIRECT(\"Z\"&(ROW()+1-$A46&\"S\"&COLUMN()-5)&\":Z\"&(ROW())&\"S\"&COLUMN()-5,0),J46)<3),\"X\",IF(AND(COUNTIF(INDIRECT(\"Z\"&(ROW()+1-$A46&\"S\"&COLUMN()-5)&\":Z\"&(ROW()+AnzSp-$A46)&\"S\"&COLUMN()-5,0),\">0\")=AnzSp,INDIRECT(\"Z\"&(ROW()+AnzSp+1-$A46)&\"S6\",0)>0,J46=LARGE(INDIRECT(\"Z\"&(ROW()+1-$A46&\"S\"&COLUMN()-5)&\":Z\"&(ROW()+AnzSp-$A46)&\"S\"&COLUMN()-5,0),2),COUNTIF(INDIRECT(\"Z\"&(ROW()+1-$A46&\"S\"&COLUMN()-5)&\":Z\"&(ROW())&\"S\"&COLUMN()-5,0),J46)=1),\"X\",\"\"))),\"\")","v":""},{"$f":"SUM(G46:J46)","v":122}]
[2,"Horn","Dennis",null,50002,"Sm 1",31,35,36,34,0,"X","X","X","X",{"$f":"SUM(G47:J47)","v":136}]
[3,"Lange","Kevin",null,879,"Jm",26,27,31,36,84,"","","","X",120]
[4,"Raschke","Marcel",null,36567,"H",28,25,26,27,106,"","","","",106]
[5,"Wesemann","Eike-Fabian",null,36292,"H",30,29,32,30,60,"","X","X","",121]
[6,"Wesemann","Florian",null,35546,"H",30,25,22,25,102,"","","","",102]
[null,{"$f":"IF(COUNT(INDIRECT(\"E\"&ROW()-AnzSp&\":E\"&ROW()-1))<=AnzSp-2,\"Kein Streicher\",IF(COUNT(INDIRECT(\"E\"&ROW()-AnzSp&\":E\"&ROW()-1))<=AnzSp-1,\"1 Streicher\",IF(AND(COUNT(INDIRECT(\"E\"&ROW()-AnzSp&\":E\"&ROW()-1))<=AnzSp,F52>0),\"2 Streicher\",\"Spieler Nr. \"&AnzSp&\" löschen und als Einzelspieler erfassen!\")))","v":"2 Streicher"},null,null,null,{"$f":"COUNTIF(INDIRECT(\"F\"&(ROW()-AnzSp)&\":F\"&ROW()-1),\"Jw\")+COUNTIF(INDIRECT(\"F\"&ROW()-AnzSp&\":F\"&ROW()-1),\"Jm\")+COUNTIF(INDIRECT(\"F\"&ROW()-AnzSp&\":F\"&ROW()-1),\"Schw\")+COUNTIF(INDIRECT(\"F\"&ROW()-AnzSp&\":F\"&ROW()-1),\"Schm\")","v":1},{"$f":"IF(COUNTIF(INDIRECT(\"G\"&ROW()-AnzSp&\":G\"&ROW()-1),\">0\")=AnzSp-2,SUM(INDIRECT(\"G\"&ROW()-AnzSp&\":G\"&ROW()-1)),IF(COUNTIF(INDIRECT(\"G\"&ROW()-AnzSp&\":G\"&ROW()-1),\">0\")=AnzSp-1,SUM(INDIRECT(\"G\"&ROW()-AnzSp&\":G\"&ROW()-1))-LARGE(INDIRECT(\"G\"&ROW()-AnzSp&\":G\"&ROW()-1),1),IF(COUNTIF(INDIRECT(\"G\"&ROW()-AnzSp&\":G\"&ROW()-1),\">0\")=AnzSp,SUM(INDIRECT(\"G\"&ROW()-AnzSp&\":G\"&ROW()-1))-LARGE(INDIRECT(\"G\"&ROW()-AnzSp&\":G\"&ROW()-1),1)-LARGE(INDIRECT(\"G\"&ROW()-AnzSp&\":G\"&ROW()-1),2),0)))","v":114},{"$f":"IF(COUNTIF(INDIRECT(\"H\"&ROW()-AnzSp&\":H\"&ROW()-1),\">0\")=AnzSp-2,SUM(INDIRECT(\"H\"&ROW()-AnzSp&\":H\"&ROW()-1)),IF(COUNTIF(INDIRECT(\"H\"&ROW()-AnzSp&\":H\"&ROW()-1),\">0\")=AnzSp-1,SUM(INDIRECT(\"H\"&ROW()-AnzSp&\":H\"&ROW()-1))-LARGE(INDIRECT(\"H\"&ROW()-AnzSp&\":H\"&ROW()-1),1),IF(COUNTIF(INDIRECT(\"H\"&ROW()-AnzSp&\":H\"&ROW()-1),\">0\")=AnzSp,SUM(INDIRECT(\"H\"&ROW()-AnzSp&\":H\"&ROW()-1))-LARGE(INDIRECT(\"H\"&ROW()-AnzSp&\":H\"&ROW()-1),1)-LARGE(INDIRECT(\"H\"&ROW()-AnzSp&\":H\"&ROW()-1),2),0)))","v":105},{"$f":"IF(COUNTIF(INDIRECT(\"I\"&ROW()-AnzSp&\":I\"&ROW()-1),\">0\")=AnzSp-2,SUM(INDIRECT(\"I\"&ROW()-AnzSp&\":I\"&ROW()-1)),IF(COUNTIF(INDIRECT(\"I\"&ROW()-AnzSp&\":I\"&ROW()-1),\">0\")=AnzSp-1,SUM(INDIRECT(\"I\"&ROW()-AnzSp&\":I\"&ROW()-1))-LARGE(INDIRECT(\"I\"&ROW()-AnzSp&\":I\"&ROW()-1),1),IF(COUNTIF(INDIRECT(\"I\"&ROW()-AnzSp&\":I\"&ROW()-1),\">0\")=AnzSp,SUM(INDIRECT(\"I\"&ROW()-AnzSp&\":I\"&ROW()-1))-LARGE(INDIRECT(\"I\"&ROW()-AnzSp&\":I\"&ROW()-1),1)-LARGE(INDIRECT(\"I\"&ROW()-AnzSp&\":I\"&ROW()-1),2),0)))","v":107},{"$f":"IF(COUNTIF(INDIRECT(\"J\"&ROW()-AnzSp&\":J\"&ROW()-1),\">0\")=AnzSp-2,SUM(INDIRECT(\"J\"&ROW()-AnzSp&\":J\"&ROW()-1)),IF(COUNTIF(INDIRECT(\"J\"&ROW()-AnzSp&\":J\"&ROW()-1),\">0\")=AnzSp-1,SUM(INDIRECT(\"J\"&ROW()-AnzSp&\":J\"&ROW()-1))-LARGE(INDIRECT(\"J\"&ROW()-AnzSp&\":J\"&ROW()-1),1),IF(COUNTIF(INDIRECT(\"J\"&ROW()-AnzSp&\":J\"&ROW()-1),\">0\")=AnzSp,SUM(INDIRECT(\"J\"&ROW()-AnzSp&\":J\"&ROW()-1))-LARGE(INDIRECT(\"J\"&ROW()-AnzSp&\":J\"&ROW()-1),1)-LARGE(INDIRECT(\"J\"&ROW()-AnzSp&\":J\"&ROW()-1),2),0)))","v":113},{"$f":"SUM(G52:J52)","v":439}]

{"sheet":"Startliste","index":5,"n_rows":34,"n_cols":4,"rows_kept":34,"cut":false,"hidden":false,"merged":[[0,0,0,3],[11,0,11,3]]}
[{"$f":"Deckblatt!A3","v":"3. Spieltag  -  Landesliga Nord  -  Saison 2019"}]
[]
[]
["Turnierleitung:",null,{"$f":"IF(Deckblatt!D6=0,\"\",Deckblatt!D6)","v":"Reinicke, Frank"},{"$f":"IF(Deckblatt!G6=0,\"\",Deckblatt!G6)","v":"MC Möve Cuxhaven"}]
[]
["Oberschiedsrichter:",null,{"$f":"IF(Deckblatt!D8=0,\"\",Deckblatt!D8)","v":"Krause, Dirk"},{"$f":"IF(Deckblatt!G8=0,\"\",Deckblatt!G8)","v":"BGC Celle"}]
["Schiedsrichter:",null,{"$f":"IF(Deckblatt!D9=0,\"\",Deckblatt!D9)","v":"Hunte, Stefanie"},{"$f":"IF(Deckblatt!G9=0,\"\",Deckblatt!G9)","v":"BGC Diepholz"}]
["Schiedsrichter:",null,{"$f":"IF(Deckblatt!D10=0,\"\",Deckblatt!D10)","v":"Weigang, Klaus-Dieter"},{"$f":"IF(Deckblatt!G10=0,\"\",Deckblatt!G10)","v":"BGC Hannover"}]
[]
[]
[]
["Startliste"]
[]
[1]
[2]
[3]
[4]
[5]
[6]
[7]
[8]
[9]
[10]
[11]
[12]
[13]
[14]
[15]
[16]
[17]
[18]
[19]
[20]
[21]

{"sheet":"Konstanten","index":6,"n_rows":37,"n_cols":7,"rows_kept":37,"cut":false,"hidden":true,"merged":[]}
[]
["Kurzbezeichnung","Reihenfolge",null,"Ligennummer","Ligenbezeichnung","Anzahl Spieler","Kategoriewertung"]
["D",1,null,1,"Bezirksklasse Nord",5,"Ja"]
["H",2,null,2,"Bezirksklasse Mitte",5,"Ja"]
["Sw 1",3,null,3,"Bezirksklasse Ost",5,"Ja"]
["Sm 1",4,null,4,"Bezirksklasse Süd",5,"Ja"]
["Sw 2",5,null,5,"Bezirksliga Nord-Mitte",5,"Ja"]
["Sm 2",6,null,6,"Landesliga Nord",6,"Nein"]
["Jw",7,null,7,"Landesliga Süd",6,"Nein"]
["Jm",8,null,8,"Verbandsliga Staffel 1",7,"Nein"]
["Schw",9,null,9,"Verbandsliga Staffel 2",7,"Nein"]
["Schm",10,null,10,"3. Bundesliga Nord Staffel 1",7,"Nein"]
[null,null,null,11,"3. Bundesliga Nord Staffel 2",7,"Nein"]
[null,null,null,12,"3. Bundesliga Nord Staffel 3",7,"Nein"]
[null,null,null,13,"2. Bundesliga Nord Staffel 1",8,"Nein"]
[null,null,null,14,"2. Bundesliga Nord Staffel 2",8,"Nein"]
[]
["1. Spieltag"]
["2. Spieltag"]
["3. Spieltag"]
["4. Spieltag"]
["5. Spieltag"]
[]
[]
[]
[]
["Aktuelle Auswahl Liga:",null,6]
["Aktuelle Auswahl Spieltag:",null,3]
["Aktuelle Anzahl der Runden",null,{"$f":"COUNT(Deckblatt!H27:K27)","v":4}]
["Anzahl der Spieler in Team",null,{"$f":"VLOOKUP(Ligawahl,Teamgröße,3,0)","v":6}]
[]
["Bahnensysteme",null,null,"blau","grün","rot"]
[null,"Miniaturgolf",1,19,24,29]
[null,"Beton",2,24,29,35]
[null,"Filzgolf",3,29,35,39]
[]
["Aktuelle Auswahl System:",null,{"$f":"VLOOKUP(Deckblatt!P9,Systemliste,2,0)","v":1},{"$f":"VLOOKUP(Deckblatt!P9,Systemliste,3,0)","v":19},{"$f":"VLOOKUP(Deckblatt!P9,Systemliste,4,0)","v":24},{"$f":"VLOOKUP(Deckblatt!P9,Systemliste,5,0)","v":29}]

{"sheet":"players","index":7,"n_rows":3979,"n_cols":11,"rows_kept":3979,"cut":false,"hidden":false,"merged":[]}
["SpielerNr","Kategorie","Vorname","Nachname","Kurzname","MVBN","LizenzNr","SC","SB","SA","TL"]
[25891,"Sm 2","Lothar","Abele","1. MGC Metzingen e.V.","","","","","",""]
[869,"Sw 2","Birgit","Abeling-Betzien","BGC Diepholz","Ja","","","","",""]
[33312,"Sm 2","Edgar","Abelmann","BGC Hannover","Ja","","","","",""]
[27712,"Sm 1","Thomas","Abendroth","Reinickendorfer MGC e.V.","","","","","",""]
[43272,"H","Hendrik","Ackermann","1. MGC Ludwigshafen e.V.","","","","","",""]
[34631,"H","Jan Sebastian","Adam","VfL Lüneburg","Ja","12733","X","","",""]
[67154,"D","Jessica","Adam","VfL Lüneburg","Ja","29732","X","","",""]
[36366,"Sm 2","Herbert","Adam","MGC Felderbachtal 1964 e.V.","","","","","",""]
[36901,"Sw 2","Gabriele","Adam","MGC Felderbachtal 1964 e.V.","","","","","",""]
[37193,"H","Tim","Adamczyk","SG Arheilgen Abt. Bahnengolf","","","","","",""]
[35408,"D","Jasmin","Adamczyk","MGC Bad Homburg vdH e.V.","","","","","",""]
[35377,"Sm 2","Michael","Adamczyk","MGC Bad Homburg vdH e.V.","","","","","",""]
[37108,"Sw 2","Astrid","Adamczyk","MGC Bad Homburg vdH e.V.","","","","","",""]
[35715,"Sm 2","Bernd","Adamski","MGC Rot-Weiß Wanne-Eickel e.V.","","","","","",""]
[46986,"Sm 1","Jürgen","Adenau","1.KGC Mönchengladbach e.V.","","","","","",""]
[29794,"H","Markus","Affeld","MSC Herscheid 1963 e.V.","","","","","",""]
[24649,"H","Alan","Ahmed","MGC Bad Oldesloe e.V.","","","","","",""]
[36151,"H","Pasi","Aho","BGC Neutraubling e.V.","","","","","",""]
[66361,"H","Marcel","Ahrens","MGC Peine","Ja","","","","",""]
[37046,"Sw 1","Mabel","Ahrentropp","HMC Büttgen e.V.","","","","","",""]
[66842,"Jw","Catharina","Aichele","MGC Monrepos e.V.","","","","","",""]
[27728,"H","Sascha","Albrecht","MGC Göttingen","Ja","","","","",""]
[66650,"D","Nassim","Alizadeh","Miniaturgolf Sportclub Schriesheim e.V","","","","","",""]
[67318,"Schm","Leon","Allmacher","MGC Traben-Trarbach","","","","","",""]
[67317,"Sm 1","Jürgen","Allmacher","MGC Traben-Trarbach","","","","","",""]
[33902,"D","Bianca","Allmüller","BGV Backumer Tal Herten e.V.","","","","","",""]
[33903,"Sm 1","Markus","Allmüller","BGV Backumer Tal Herten e.V.","","","","","",""]
[29237,"Sm 1","Peter","Amberger","BGC Neutraubling e.V.","","","","","",""]
[67242,"Sm 1","Tobias","Amely","MSC Bad Godesberg e.V.","","","","","",""]
[5720,"Sm 2","Wolfgang","Ament","SV 1890 e.V. Dreieichenhain, Abt. Bahnengolf","","","","","",""]
[50612,"H","Oliver","Anders","MGC Dortmund Syburg e.V.","","","","","",""]
[44990,"Sm 1","Alexander","Anders","BGSV Castrop e.V. 1961","","","","","",""]
[66492,"Sm 1","Uwe","Andrejewski","1. MGC Gelsenkirchen e.V.","","","","","",""]
[66109,"Sm 1","Andre","Andresen","BGC Kiel West e.V.","","","","","",""]
[37496,"Sm 2","Klaus-Dieter","Andresen","MGC Harrislee-Wassersleben","","","","","",""]
[66201,"Sm 2","Bernd","Andrzejak","MGC Rot-Weiß Wanne-Eickel e.V.","","","","","",""]
[67210,"Sm 2","Karl-Heinz","Angabreit","BGC Uerdingen e.V.","","","","","",""]
[66678,"H","Florian","Angermaier","MGC Bad Feilnbach e.V.","","","","","",""]
[4969,"Sm 2","Manfred","Anlauff","1. MC Weinheim e.V.","","","","","",""]
[67183,"Schm","Robin","Antholz","MSG Kempten e.V.","","","","","",""]
[66920,"D","Stephanie","Anton","1. BGC Rodalben 1977 e.V.","","","","","",""]
[66879,"Schm","Sean","Anton","1. BGC Rodalben 1977 e.V.","","","","","",""]
[27278,"Sm 1","Udo","Apelmeier","BV Sennestadt","","","","","",""]
[45054,"Sm 1","Willi","Appel","Miniaturgolf Sportclub Schriesheim e.V","","","","","",""]
[32949,"Sm 2","Dieter","Appelhans","BV Sennestadt","","","","","",""]
[29034,"H","André","Appelmann","VfM Bottrop e.V.","","","","","",""]
[36479,"D","Laura","Appelmann","VfM Bottrop e.V.","","","","","",""]
[47183,"H","Sascha","Arendt","BGSV Castrop e.V. 1961","","","","","",""]
[67250,"Sw 1","Angelina","Arendt","BGSV Castrop e.V. 1961","","","","","",""]
[27450,"Sm 1","Ingo","Arens","BSC Ennepetal e.V.","","","","","",""]
[26327,"H","Christoph","Arenz","MSC Bad Godesberg e.V.","","","","","",""]
[4769,"Sm 2","Heinz Josef","Arenz","MSC Bad Godesberg e.V.","","","","","",""]
[37811,"Sm 2","Helmut","Arlt","SV Gebhardshagen","Ja","","","","",""]
[60227,"Sm 2","Gerhard","Arndt","VfL Lohbrügge Abt. Bahnengolf","","","","","",""]
[35780,"H","Mark","Arnold","SG Arheilgen Abt. Bahnengolf","","","","","",""]
[60125,"Sm 2","Kurt","Arnold","MGC Murnau am Staffelsee e.V.","","","","","",""]
[35779,"Sm 2","Günter","Arnold","BGSV Aßlar 1987 e.V.","","","","","",""]
[18435,"Sm 2","Klaus","Arnold","HMC Büttgen e.V.","","","","","",""]
[35778,"Sw 2","Franziska","Arnold","BGSV Aßlar 1987 e.V.","","","","","",""]
[36179,"Sm 1","Marco","Arnsberg","MV Lankwitzer Dragons","","","","","",""]
[66447,"Sm 2","Stefan","Arweiler","Freizeit Club Bliesen e.V.","","","","","",""]
[33616,"Sm 1","Jörg","Asmuß","MGC Brunsbüttel e.V.","","","","","",""]
[23975,"Sm 1","Bernd","Aßmuth","Bochumer Minigolf-Club 1960 e.V.","","","","","",""]
[32897,"Sm 2","Manfred","Außerwinkler","BGC Hannover","Ja","","","","",""]
[29208,"Sm 1","Thomas","Aussieker","BGSV Castrop e.V. 1961","","","","","",""]
[67205,"Sm 1","Jürgen","Aust","VfM Bottrop e.V.","","","","","",""]
[66405,"Sw 1","Manuela","Aust","BSC Ennepetal e.V.","","","","","",""]
[67206,"Sw 2","Petra","Aust","VfM Bottrop e.V.","","","","","",""]
[66749,"D","Anna","Averbakh","BGC Hannover","Ja","","","","",""]
[15754,"H","Sascha","Axer","Kölner Miniatur Golf Club e.V.","","","","","",""]
[49266,"Sm 2","Reiner","Axer","Kölner Miniatur Golf Club e.V.","","","","","",""]
[49267,"Sw 2","Claudia","Axer","Kölner Miniatur Golf Club e.V.","","","","","",""]
[29229,"Sm 1","Manfred","Axtner","CGC Illertal Kellmünz","","","","","",""]
[19768,"Sm 2","Stjepan","Babic","BIG ASPERG e.V.","","","","","",""]
[4444,"Sm 2","Peter","Bach","MGC Oberkochen e.V.","","","","","",""]
[29939,"Sm 1","Peter","Bachmann","MGC Göttingen","Ja","9533","","X","",""]
[43674,"Sw 1","Sabine","Bachmann","MGC Göttingen","Ja","","","","",""]
[35588,"Sm 2","Robert","Bader","MGC Murnau am Staffelsee e.V.","","","","","",""]
[35587,"Sw 2","Elfriede","Bader","MGC Murnau am Staffelsee e.V.","","","","","",""]
[43414,"Sm 2","Gerhard","Badtke","BGC Bad Nenndorf","Ja","17979","","X","","X"]
[46800,"Sw 2","Monika","Badtke","BGC Bad Nenndorf","Ja","","","","",""]
[37761,"Sm 1","Torsten","Badziong","MGC Freizeitzentrum Biebertal","","","","","",""]
[37355,"Sm 2","Uwe","Baer","1. BGC Wesseling 1975 e.V.","","","","","",""]
[44139,"Sm 1","Thomas","Bahr","BGSV Castrop e.V. 1961","","","","","",""]
[46033,"H","Sascha","Bähr","Niendorfer MC","","","","","",""]
[29699,"Sm 2","Hans","Baier","MGC Oberkochen e.V.","","","","","",""]
[37654,"Sm 1","Dieter","Baierl","MGC Ingolstadt e.V.","","","","","",""]
[37653,"Sw 1","Andrea","Baierl","MGC Ingolstadt e.V.","","","","","",""]
[48505,"Sm 1","Varyam-Mirza","Baig","MGC Wetzlar e.V.","","","","","",""]
[4489,"Sm 2","Karl-Heinz","Bailer","MGC 85 Bönnigheim","","","","","",""]
[33109,"Sm 2","Heinz","Balbach","MGC Unterschneidheim e.V.","","","","","",""]
[67268,"Sm 2","Thomas","Baldauf","BSG Pneumant Fürstenwalde e.V., Abt. Minigolf","","","","","",""]
[66669,"Sm 1","Thomas","Balf","BGC Uerdingen e.V.","","","","","",""]
[67281,"Jm","Kreon","Balis","1. Münchener MGC e.V.","","","","","",""]
[33514,"H","Christian","Balleininger","1. MGC Bamberg e.V.","","","","","",""]
[5910,"Sm 2","Lyo","Balleininger","1. MGC Bamberg e.V.","","","","","",""]
[40906,"D","Yvonne","Baltes","MSC Bad Godesberg e.V.","","","","","",""]
[46565,"Sw 1","Iris","Balzer","1. Porzer MGC Grün-Weiß 1969 e.V.","","","","","",""]
[3354,"Sm 2","Hans","Balzer","1. Porzer MGC Grün-Weiß 1969 e.V.","","","","","",""]
[5073,"Sm 2","Max","Balzereit","BSC Ennepetal e.V.","","","","","",""]
[38190,"H","Dennis","Bamberg","1. MGC Saar 68 St. Ingbert e.V.","","","","","",""]
[42482,"Sm 1","Michael","Bamberg","1. MGC Mainz e.V.","","","","","",""]
[25993,"Sw 1","Gabriele","Bamberg","1. MGC Mainz e.V.","","","","","",""]
[48318,"H","Tobias","Bär","MGC Bad Hersfeld","","","","","",""]
[38333,"Sw 1","Claudia","Barber","MSV Würzburg-Löwenbrücke e.V.","","","","","",""]
[43841,"Sm 1","Jens","Bardenhagen","MGC Brunsbüttel e.V.","","","","","",""]
[25214,"Sm 2","Stefan","Bärenz","SV 1890 e.V. Dreieichenhain, Abt. Bahnengolf","","","","","",""]
[37576,"Sm 2","Bernd","Bargenda","MGC Harrislee-Wassersleben","","","","","",""]
[67241,"Sm 1","Heinz","Bark","MGC Dortmund Syburg e.V.","","","","","",""]
[36967,"Sm 1","Thomas","Barke","1. Essener CGC \"Blau-Gold\" e.V.","","","","","",""]
[38123,"Sm 1","Mario","Barke","1. Essener CGC \"Blau-Gold\" e.V.","","","","","",""]
[29656,"H","René","Barlog","Bochumer Minigolf-Club 1960 e.V.","","","","","",""]
[66068,"Sm 2","Hermann","Barnstorf","VfL Lüneburg","Ja","","","","",""]
[38086,"H","Daniel","Bärsch","BGC Leipzig","","","","","",""]
[67323,"Sm 2","Michael","Bartel","Osnabrücker M.-C. von 1963 e.V.","","","","","",""]
[36395,"Sm 1","Harald","Barth","1. BGC Wesseling 1975 e.V.","","","","","",""]
[50563,"Sw 1","Susanne","Barth","MSC Bad Godesberg e.V.","","","","","",""]
[66777,"H","Patrick","Bartholomä","MGC Kassel","Ja","","","","",""]
[66896,"H","Pierre","Bartholomä","MGC Kassel","Ja","","","","",""]
[41145,"Sm 1","Volker","Bartmann","BGSV Bad Homburg","","","","","",""]
[67404,"Sm 2","Paul","Bartsch","BV Sennestadt","","","","","",""]
[38103,"H","Patrick","Barz","MGC Göttingen","Ja","","","","",""]
[38104,"Sm 1","Ralf","Barz","VfM e.V. Berlin ","","","","","",""]
[38102,"Sw 1","Birgit","Barz","VfM e.V. Berlin ","","","","","",""]
[46055,"Sm 2","Andreas","Barz","MGC Olympia Kiel e.V.","","","","","",""]
[37582,"D","Ann-Kathrin","Bastian","BGC Bildstock e.V.","","","","","",""]
[37583,"Sw 1","Claudia","Bastian","BGC Bildstock e.V.","","","","","",""]
[46910,"Sm 2","Richard","Bätge","SV Gebhardshagen","Ja","20059","","","","X"]
[65848,"Jm","Adrian","Batschkus","1. Münchener MGC e.V.","","","","","",""]
[66273,"Schm","Quirin","Batschkus","1. Münchener MGC e.V.","","","","","",""]
[23741,"Sm 1","Wolfgang","Battig","MC 62 Lüdenscheid e.V.","","","","","",""]
[37799,"H","Jan Hendrik","Battling","MGC \"AS\" Witten 1963 e.V.","","","","","",""]
[34490,"Sm 1","Thomas","Bätz","MSC Bad Godesberg e.V.","","","","","",""]
[67284,"H","Thorsten","Bauer","MSK Olching e.V.","","","","","",""]
[67282,"D","Daniela","Bauer","MSK Olching e.V.","","","","","",""]
[67283,"Schw","Selina","Bauer","MSK Olching e.V.","","","","","",""]
[40471,"Sm 1","Helmut","Bauer","1. MGC München-Feldmoching e.V.","","","","","",""]
[46532,"Sm 1","Siegfried","Bauer","BGC Bad Berneck e.V.","","","","","",""]
[40864,"Sm 1","Martin","Bauer","BGC Bildstock e.V.","","","","","",""]
[5751,"Sm 2","Helmut","Bauerfeld","Freizeit Club Bliesen e.V.","","","","","",""]
[28605,"Sm 1","Stephan","Bauermeister","MGC Murnau am Staffelsee e.V.","","","","","",""]
[36137,"Sw 1","Barbara","Bauermeister","MGC Murnau am Staffelsee e.V.","","","","","",""]
[46616,"H","Marcus","Bauhofer","BGC Heilbronn e.V.","","","","","",""]
[36563,"H","Oliver","Baum","SV Gebhardshagen","Ja","","","","",""]
[65195,"Sm 1","Harald","Baumann","MGF Waldshut 74 e.V.","","","","","",""]
[37803,"Sm 2","Wolfgang","Baumbach","1. MGC Saar 68 St. Ingbert e.V.","","","","","",""]
[26398,"H","Daniel","Baumer","1. MGC München-Feldmoching e.V.","","","","","",""]
[3998,"Sm 2","Klaus","Baumer","BGC Illertissen e.V.","","","","","",""]
[47033,"Sw 2","Ruth","Baumer","BGC Illertissen e.V.","","","","","",""]
[37760,"H","Thorben","Baumgart","MSK Neheim-Hüsten e.V.","","","","","",""]
[29220,"Sm 1","Dirk","Baumgart","MSK Neheim-Hüsten e.V.","","","","","",""]
[38226,"H","Wolfgang","Bäurle","ASV Pegnitz, Abt. Minigolf","","","","","",""]
[38639,"Jm","Fabian","Bayer","MGF Ottobrunn e.V.","","","","","",""]
[67374,"Schm","Tobias","Bayer","BIG ASPERG e.V.","","","","","",""]
[38632,"Sm 1","Jimmy","Bayer","MGC Murnau am Staffelsee e.V.","","","","","",""]
[66645,"Sm 1","Wolfgang","Bayer","MGC Murnau am Staffelsee e.V.","","","","","",""]
[5942,"Sm 2","Hubert","Bayer","1. BGC Landshut e.V.","","","","","",""]
[67061,"Sm 2","Willi","Bayer","BIG ASPERG e.V.","","","","","",""]
[66112,"Sm 2","Erich","Beausencourt","Minigolf-Club Diessen","","","","","",""]
[66712,"Jm","Deniz-Benett","Beceriklier","MGC Lippe-Detmold e.V.","","","","","",""]
[66500,"Sw 1","Andrea","Becher","MSK Olching e.V.","","","","","",""]
[66892,"H","Christian","Beck","1. BGC Landshut e.V.","","","","","",""]
[67204,"Jm","Simon","Beck","BGC Leipzig","","","","","",""]
[40688,"Sm 1","Oliver","Beck","MSV Bad Kreuznach","","","","","",""]
[46021,"Sm 2","Bernhard","Beck","1. KC Homburg-Saar 1967 e.V.","","","","","",""]
[38570,"H","Jan","Becker","SG Arheilgen Abt. Bahnengolf","","","","","",""]
[66162,"H","Lars","Becker","SG Arheilgen Abt. Bahnengolf","","","","","",""]
[37559,"H","Florian","Becker","MSK Neheim-Hüsten e.V.","","","","","",""]
[35385,"H","Timo","Becker","MGC Schwaikheim e.V.","","","","","",""]
[67092,"D","Cecina","Becker","SG  Weiterstadt 1886 e.V.","","","","","",""]
[35103,"D","Daniela","Becker","MGC Heven e.V.","","","","","",""]
[38593,"D","Anna Lisa","Becker","1. MGC Saar 68 St. Ingbert e.V.","","","","","",""]
[33442,"Sm 1","Martin","Becker","Reinickendorfer MGC e.V.","","","","","",""]
[37225,"Sm 1","Michael","Becker","SG  Weiterstadt 1886 e.V.","","","","","",""]
[44304,"Sm 1","Norbert","Becker","SG Arheilgen Abt. Bahnengolf","","","","","",""]
[26506,"Sm 1","Gerd","Becker","MGC Dortmund Syburg e.V.","","","","","",""]
[44303,"Sw 1","Karin","Becker","SG Arheilgen Abt. Bahnengolf","","","","","",""]
[25999,"Sw 1","Ursula","Becker","1. MGC Mannheim 1968 e.V.","","","","","",""]
[3591,"Sm 2","Werner","Becker","BSV Inzlingen 1979 e.V.","","","","","",""]
[66583,"Sm 2","Heinz","Becker","MGC Bad Soden-Salmünster","","","","","",""]
[35612,"Sm 2","Walter","Becker","1. MGC Ludwigshafen e.V.","","","","","",""]
[12781,"Sm 2","Hans-Dieter","Becker","MSK Neheim-Hüsten e.V.","","","","","",""]
[40005,"Sm 2","Michael","Becker","SGC Hagen e.V.","","","","","",""]
[66584,"Sw 2","Renate","Becker","MGC Bad Soden-Salmünster","","","","","",""]
[4101,"Sw 2","Erika","Becker","MGC Dortmund Syburg e.V.","","","","","",""]
[65404,"Sm 1","Martin","Beckert","MSV Bad Münder/Springe","Ja","","","","",""]
[26620,"Sm 1","Thomas","Beckmann","MSK Neheim-Hüsten e.V.","","","","","",""]
[37899,"Sm 1","Joachim","Bednar","1. MGC Mannheim 1968 e.V.","","","","","",""]
[34186,"H","Stephan","Behrens","Niendorfer MC","","","","","",""]
[67107,"H","Markus","Behrens","BGC Goslar","Ja","","","","",""]
[67123,"Schm","Julien","Behrens","BGC Goslar","Ja","","","","",""]
[65679,"Sw 1","Susanne","Behrens","BGC Goslar","Ja","","","","",""]
[37706,"Sm 2","Wolfgang","Behrens","Minigolfclub Karlshagen e.V.","","","","","",""]
[65678,"Sm 2","Friedhelm","Behrens","BGC Goslar","Ja","","","","",""]
[65677,"Sw 2","Christiane","Behrens","BGC Goslar","Ja","","","","",""]
[42529,"Sm 1","Harald","Beier","1. MGC Mitterteich-Großbüchlberg","","","","","",""]
[42528,"Sm 2","Jürgen","Beier","1. MGC Mitterteich-Großbüchlberg","","","","","",""]
[66569,"Sm 2","Christian","Beier","MC Möve Cuxhaven","Ja","28681","","X","",""]
[4750,"Sw 2","Sylvia","Beierle","2. MGC Worms","","","","","",""]
[60102,"Sm 2","Helmut","Beißwenger","Hamburger MC von 1965 e.V.","","","","","",""]
[36192,"Sm 2","Hans-Jürgen","Bellanger","1. MGC Mannheim 1968 e.V.","","","","","",""]
[36191,"Sw 2","Martina","Bellanger","1. MGC Mannheim 1968 e.V.","","","","","",""]
[33091,"H","Marvin","Below","MGC Olympia Kiel e.V.","","","","","",""]
[37097,"H","Gerrit","Below","MGC Olympia Kiel e.V.","","","","","",""]
[42124,"Sm 1","Ralf","Belz","MGC Dormagen-Brechten e.V.","","","","","",""]
[35698,"Sm 2","Wilfried","Bemelmanns","MGC Dormagen-Brechten e.V.","","","","","",""]
[6059,"Sm 2","Lutz","Bemmann","BSV AOK Leipzig e.V.","","","","","",""]
[35539,"D","Jasmin","Beneking","MSK Neheim-Hüsten e.V.","","","","","",""]
[183,"Sm 2","Erwin","Beneking","MC Georgsmarienhütte e.V.","","","","","",""]
[33623,"H","Marius","Benkert","MGC Ostheim / Rhön e.V.","","","","","",""]
[37425,"D","Katharina","Benkert","MGC Ostheim / Rhön e.V.","","","","","",""]
[66790,"Sm 2","Holger","Benn","VfL Lohbrügge Abt. Bahnengolf","","","","","",""]
[27563,"Sm 2","Harald","Benner","MSC Herscheid 1963 e.V.","","","","","",""]
[62722,"Sm 2","Friedhelm","Benner","MSC Herscheid 1963 e.V.","","","","","",""]
[37894,"H","Adam","Ber","Minigolfclub Karlshagen e.V.","","","","","",""]
[38210,"D","Jessica","Ber","Minigolfclub Karlshagen e.V.","","","","","",""]
[37630,"Sm 2","Peter","Ber","Minigolfclub Karlshagen e.V.","","","","","",""]
[37872,"Sw 2","Elvira","Ber","Minigolfclub Karlshagen e.V.","","","","","",""]
[2083,"H","Peter","Ber Jun.","Minigolfclub Karlshagen e.V.","","","","","",""]
[37997,"Sm 1","Gerhard","Bergauer","BGSC Bochum 1978 e.V.","","","","","",""]
[46384,"H","Martin","Berger","VfM e.V. Berlin ","","","","","",""]
[66786,"H","Dominik","Berghof","SV Lurup Abt. Bahnengolf","","","","","",""]
[38591,"Sm 2","Günter","Bergmaier","MGC Bad Feilnbach e.V.","","","","","",""]
[34067,"H","Lars","Bergmann","SSC Halver e.V.","","","","","",""]
[66013,"Sm 1","Uwe","Bergmann","MGC Millennium Lorsch e.V.","","","","","",""]
[5537,"Sw 2","Waltraut","Bergmann","BGC Heilbronn e.V.","","","","","",""]
[40559,"Sm 1","Reiner","Bergsmann","MGC Sulzfeld e.V.","","","","","",""]
[29362,"Sm 1","Patrick","Beringhausen","1. MGC Mainz e.V.","","","","","",""]
[6581,"Sm 2","Franz-Josef","Berkenkopf","MSK Neheim-Hüsten e.V.","","","","","",""]
[48006,"Sw 1","Susanne","Berneit","MSC Bensheim-Auerbach e.V.","","","","","",""]
[66893,"Schm","Raphael","Berner","MGC Kassel","Ja","","","","",""]
[42851,"Sm 1","Frank","Bernhard","SSC Attendorn e.V.","","","","","",""]
[66512,"D","Erika","Bernhardt","1. MGC Tuttlingen e.V.","","","","","",""]
[23895,"Sm 2","Hans-Jürgen","Berschansky","TSV Salzgitter","Ja","","","","",""]
[52088,"D","Yvonne","Berthel-Kolbe","MGC Kassel","Ja","","","","",""]
[44982,"Sm 1","Christian","Beschorner","MGC Freizeitzentrum Biebertal","","","","","",""]
[30217,"Sm 1","Roland","Best","1. NMC Kelheim e.V.","","","","","",""]
[67391,"Sw 1","Lucie","Betsch","BGS Hardenberg-Pötter e.V.","","","","","",""]
[29631,"Sm 1","Marco","Bettger","1. MSC Wesel 6.6.1966 e.V.","","","","","",""]
[41029,"Sm 2","Norbert","Betz","BGC Bad Berneck e.V.","","","","","",""]
[25369,"D","Nicole","Betzholz","1. CKF Dudweiler e.V.","","","","","",""]
[31966,"Sm 2","Horst","Betzholz","1. CKF Dudweiler e.V.","","","","","",""]
[32105,"H","André","Betzien","BGC Diepholz","Ja","10819","","","",""]
[5612,"Sm 2","Boto von","Beuningen","VfL Lohbrügge Abt. Bahnengolf","","","","","",""]
[27202,"Sm 1","Jürgen","Beutin","1. MGC Ludwigshafen e.V.","","","","","",""]
[47156,"H","Bernd","Beutler","BGSC \"Gut Schlag\" Gladbeck e.V.","","","","","",""]
[18418,"Sw 2","Cordula","Beutner","MGF Steinbruch Kempten","","","","","",""]
[46243,"Sm 2","Hartmut","Bever","1. MGC Gelsenkirchen e.V.","","","","","",""]
[67193,"Jm","Lukas","Beyer","MGC Kassel","Ja","","","","",""]
[67192,"Sm 1","Frank","Beyer","MGC Kassel","Ja","","","","",""]
[4189,"Sm 2","Bernd","Bezler","SV Gebhardshagen","Ja","","","","",""]
[5647,"Sw 2","Barbara","Bezler","SV Gebhardshagen","Ja","","","","",""]
[65844,"Sm 1","Siegfried","Biastoch","BGV Backumer Tal Herten e.V.","","","","","",""]
[67417,"H","Patrick","Bichler","BGSV Aßlar 1987 e.V.","","","","","",""]
[66914,"Sm 2","Detlef","Bieber","BGC Celle","Ja","","","","",""]
[40050,"H","Maik","Biedron","MC Möve Cuxhaven","Ja","","","","",""]
[65854,"H","Malte","Biegler","1. MGC Mainz e.V.","","","","","",""]
[65855,"Jm","Ole","Biegler","1. MGC Mainz e.V.","","","","","",""]
[33681,"Sm 1","Thomas","Biehl","BGC Schweinfurt e.V.","","","","","",""]
[35862,"Sm 1","Frank","Bielak","BSC Ennepetal e.V.","","","","","",""]
[67244,"H","Swen","Bielmann","1. MGC Gelsenkirchen e.V.","","","","","",""]
[63302,"Sm 2","Kurt","Bien","1. MGC Ludwigshafen e.V.","","","","","",""]
[28606,"Sm 1","Florian","Bieringer","MGC Murnau am Staffelsee e.V.","","","","","",""]
[33608,"H","Christoph","Biermann","MC Tigers Künsebeck","","","","","",""]
[46401,"Sm 1","Manfred","Biller","BGC Neutraubling e.V.","","","","","",""]
[66651,"Sw 1","Christine","Biller","BGC Neutraubling e.V.","","","","","",""]
[67098,"Sm 2","Manfred","Binder","MGC Harrislee-Wassersleben","","","","","",""]
[31142,"D","Nicole","Birkelbach","MGC Göttingen","Ja","","","","",""]
[65516,"Sm 1","Frank","Bischoff","BSV Inzlingen 1979 e.V.","","","","","",""]
[35522,"Sm 1","Nicolai","Bischoff","Hamburger MC von 1965 e.V.","","","","","",""]
[48247,"Sm 1","Frank","Bissinger","MGC Monrepos e.V.","","","","","",""]
[67004,"Sw 1","Vera","Bissinger","MGC Monrepos e.V.","","","","","",""]
[30713,"H","Martin","Bittner","MGC Murnau am Staffelsee e.V.","","","","","",""]
[46690,"Sm 1","Christian","Bittner","MGC Murnau am Staffelsee e.V.","","","","","",""]
[31649,"Sm 1","Peter Klaus","Bittner","BGSV Bad Homburg","","","","","",""]
[35663,"Sw 1","Nicole","Blasek","1. MGC Köln 1961 e.V.","","","","","",""]
[66402,"H","Marc","Bläsing","BGS Hardenberg-Pötter e.V.","","","","","",""]
[66906,"Schm","Leon","Bläsing","BGS Hardenberg-Pötter e.V.","","","","","",""]
[66403,"D","Julia","Bläsing-Drechsel","BGS Hardenberg-Pötter e.V.","","","","","",""]
[33127,"D","Gesa","Blechert","MGC Olympia Kiel e.V.","","","","","",""]
[52084,"Sw 2","Gabriele","Blechert","MGC Olympia Kiel e.V.","","","","","",""]
[42233,"Sw 1","Renate","Blechschmidt","1. NMC Kelheim e.V.","","","","","",""]
[42234,"Sm 2","Gerhard","Blechschmidt","1. NMC Kelheim e.V.","","","","","",""]
[31333,"D","Stefanie","Blendermann","1. MGC Mainz e.V.","","","","","",""]
[28040,"Sm 2","Werner","Bless","BSV 82 Ohlsbach e.V.","","","","","",""]
[28041,"Sw 2","Daniela","Bless","BSV 82 Ohlsbach e.V.","","","","","",""]
[37103,"H","Tim","Blöcker","1. MSC Wesel 6.6.1966 e.V.","","","","","",""]
[37796,"Sm 2","Harald","Blöcker","MSK Neheim-Hüsten e.V.","","","","","",""]
[37104,"Sw 2","Rosemarie","Blöcker","MSK Neheim-Hüsten e.V.","","","","","",""]
[34063,"Sm 1","Bernhard","Blöckl","1. MGC München-Feldmoching e.V.","","","","","",""]
[2275,"Sm 1","Detlev","Blume","BGC Hannover","Ja","","","","",""]
[66049,"H","Severin","Blümer","1. MSC Wesel 6.6.1966 e.V.","","","","","",""]
[66391,"Sm 1","Hardy","Blumhoff","SV 1890 e.V. Dreieichenhain, Abt. Bahnengolf","","","","","",""]
[43555,"Sm 1","Jens","Bock","SV Lurup Abt. Bahnengolf","","","","","",""]
[67191,"Sm 1","Norbert","Böcker","SG Arheilgen Abt. Bahnengolf","","","","","",""]
[38640,"H","Christian","Bode","BGC Hannover","Ja","","","","",""]
[66386,"Sw 2","Waltraut","Bode","SV Gebhardshagen","Ja","","","","",""]
[43782,"Sm 1","Hans-Jochen","Boenisch","BGC Northeim","Ja","18185","","X","","X"]
[21681,"Sm 2","Volker","Bogdahn","MC 62 Lüdenscheid e.V.","","","","","",""]
[67113,"Sm 1","Ulrich","Bohle","1. MGC Gelsenkirchen e.V.","","","","","",""]
[67172,"Sm 2","Hans-Dieter","Bohleber","BSV 82 Ohlsbach e.V.","","","","","",""]
[18421,"Sm 2","Ernst","Böhm","MGC Murnau am Staffelsee e.V.","","","","","",""]
[4126,"Sm 2","Uwe","Bohnenkämper","MGC Wuppertal-Ronsdorf 1967 e.V.","","","","","",""]
[5964,"Sm 2","Wolfgang","Bojack","MSV Würzburg-Löwenbrücke e.V.","","","","","",""]
[66315,"Sm 1","Richard","Bölle","Kölner Miniatur Golf Club e.V.","","","","","",""]
[40384,"D","Anne","Bollrich","MGC Dormagen-Brechten e.V.","","","","","",""]
[38537,"Sm 1","Jens","Bollrich","BGC Leipzig","","","","","",""]
[65740,"Sw 1","Margit","Bollrich","BGC Leipzig","","","","","",""]
[36329,"H","Tobias","Boltze","1. BGC Rodalben 1977 e.V.","","","","","",""]
[25581,"Sm 1","Uwe","Boltze","1. BGC Rodalben 1977 e.V.","","","","","",""]
[25578,"Sw 1","Kornelia","Boltze","1. BGC Rodalben 1977 e.V.","","","","","",""]
[38174,"H","David","Bomblies","MGC \"AS\" Witten 1963 e.V.","","","","","",""]
[38175,"H","Timo","Bomblies","MGC \"AS\" Witten 1963 e.V.","","","","","",""]
[38176,"Sm 2","Wolfgang","Bomblies","MGC \"AS\" Witten 1963 e.V.","","","","","",""]
[38473,"H","Jean-Pierre","Bonacker","BGV Backumer Tal Herten e.V.","","","","","",""]
[67118,"Jm","Luc","Bonder","1. BGC Paderborn e.V.","","","","","",""]
[36836,"Sm 2","Bernhard","Bonder","1. BGC Paderborn e.V.","","","","","",""]
[21702,"Sm 1","Frank","Bonenberger","1. MGC Ludwigshafen e.V.","","","","","",""]
[41704,"H","Pascal","Bonrath","MGC Wuppertal-Ronsdorf 1967 e.V.","","","","","",""]
[36323,"H","Patrick","Bönsch","KGC Bad Urach e.V.","","","","","",""]
[41667,"Sm 1","Jürgen","Bönsch","KGC Bad Urach e.V.","","","","","",""]
[41663,"Sw 1","Heidi","Bönsch","KGC Bad Urach e.V.","","","","","",""]
[41671,"Sm 2","Roland","Bönsch","KGC Bad Urach e.V.","","","","","",""]
[46859,"H","Thomas","Boock","MGC Olympia Kiel e.V.","","","","","",""]
[37249,"Sw 2","Cornelia","Boock","MSC Bensheim-Auerbach e.V.","","","","","",""]
[42763,"Sm 1","Nils","Boos","MGC Bad Bodendorf e.V.","","","","","",""]
[17898,"Sw 2","Charlotte","Boos","2. MGC Worms","","","","","",""]
[66945,"H","Jens","Börger","MC Georgsmarienhütte e.V.","","","","","",""]
[66946,"Jm","Pascal","Börger","MC Georgsmarienhütte e.V.","","","","","",""]
[43756,"H","Jens","Borggraefe","1. MGC Ludwigshafen e.V.","","","","","",""]
[36624,"D","Martina","Borggraefe","1. MGC Ludwigshafen e.V.","","","","","",""]
[10087,"Sm 2","Gert","Bork","1. MSC Wesel 6.6.1966 e.V.","","","","","",""]
[34108,"Sw 2","Elisabeth","Bork","1. MSC Wesel 6.6.1966 e.V.","","","","","",""]
[33880,"H","Michael","Born","Bochumer Minigolf-Club 1960 e.V.","","","","","",""]
[25918,"Sm 1","Thomas","Born","BSC Ennepetal e.V.","","","","","",""]
[27803,"D","Bianca","Bornhöft","MGC Olympia Kiel e.V.","","","","","",""]
[38240,"Sm 2","Karl Heinz","Bornkessel","SV Lurup Abt. Bahnengolf","","","","","",""]
[38241,"Sw 2","Margit","Bornkessel","SV Lurup Abt. Bahnengolf","","","","","",""]
[23605,"H","Marcel","Bort","BGC Heilbronn e.V.","","","","","",""]
[49091,"Sm 1","Thomas","Bort","BGC Heilbronn e.V.","","","","","",""]
[49092,"Sw 1","Elke","Bort","BGC Heilbronn e.V.","","","","","",""]
[38178,"Sm 2","Wilfried","Bosen","1. MGSV Netphen e.V.","","","","","",""]
[66066,"Sm 2","Joachim","Bosse","MGC Bad Salzuflen e.V.","","","","","",""]
[36834,"Sm 2","Dieter","Bothe","SV Gebhardshagen","Ja","","","","",""]
[45560,"H","Patrick","Bothmann","MGC Dormagen-Brechten e.V.","","","","","",""]
[46348,"H","Andreas","Bott","MGC Sulzfeld e.V.","","","","","",""]
[32231,"H","Steven","Böttcher","MGC Göttingen","Ja","10869","X","","",""]
[3602,"Sm 2","Wilhelm","Böttcher","VfB Osnabrück e.V.","","","","","",""]
[67134,"Sm 2","Saban","Bozkurt","MGC Heringen 1997 e.V.","","","","","",""]
[47419,"Sm 1","Roland","Brack","BSV 82 Ohlsbach e.V.","","","","","",""]
[66229,"Jm","Jannick","Bracken","MGC Wertheim 91 e.V.","","","","","",""]
[38110,"H","Cedric","Brakhage","MGC Lippe-Detmold e.V.","","","","","",""]
[45769,"H","Markus","Brand","MGC Traben-Trarbach","","","","","",""]
[62193,"Sm 2","Wilhelm","Brand","1. BGC Paderborn e.V.","","","","","",""]
[4611,"Sw 2","Ursula","Brand","1. BGC Paderborn e.V.","","","","","",""]
[40419,"Sm 1","Wolfgang","Brandes","BGC Wolfsburg","Ja","16374","","","","X"]
[29046,"Sm 2","Peter","Brandis","TSV Kücknitz Abt. Bahnengolf","","","","","",""]
[605,"Sm 2","Michael","Brandl","BGC Heilbronn e.V.","","","","","",""]
[29239,"Sm 1","Michael","Brandner","CGC Illertal Kellmünz","","","","","",""]
[65833,"Sm 1","Uwe","Brandstettner","SV Gebhardshagen","Ja","27415","X","","",""]
[28747,"Sm 1","Ralph","Brandt","Preetzer TSV von 1861 e.V. Abt. Minigolf","","","","","",""]
[489,"Sw 1","Judith","Brandt","CGC Rauschenberg e.V.","","","","","",""]
[24151,"Sm 2","Tobias","Brandt","CGC Rauschenberg e.V.","","","","","",""]
[5165,"Sm 2","Hans-Jürgen","Brandt","BGSV Kerpen e.V.","","","","","",""]
[65645,"H","Felix","Braschler","1. MGC Hechingen","","","","","",""]
[65644,"Sw 1","Carola","Braschler","1. MGC Hechingen","","","","","",""]
[33954,"Sm 1","Andreas","Brassait","SC Gut Heil Neumünster e.V.","","","","","",""]
[67410,"Sm 2","Dankmar","Braucks","MSF Brilon e.V.","","","","","",""]
[30395,"H","Markus","Bräuer","MGC Marl 1960 e.V.","","","","","",""]
[32390,"H","Daniel","Bräuer","MGC Marl 1960 e.V.","","","","","",""]
[37085,"H","Florian","Bräuer","MGC Marl 1960 e.V.","","","","","",""]
[51380,"D","Diana","Bräuer","MGC Marl 1960 e.V.","","","","","",""]
[37557,"Sw 2","Ute","Bräuer","MGC Marl 1960 e.V.","","","","","",""]
[65866,"Jw","Jette","Braun","MGC Olympia Kiel e.V.","","","","","",""]
[41465,"Sm 1","Wolfram","Braun","MGC Göttingen","Ja","","","","",""]
[66847,"Sm 1","Gerd","Braun","BGC Uerdingen e.V.","","","","","",""]
[67188,"Sm 1","Dierk","Braun","BGSC \"Gut Schlag\" Gladbeck e.V.","","","","","",""]
[29547,"Sm 1","Thorsten","Braun","MGC Olympia Kiel e.V.","","","","","",""]
[65752,"Sw 1","Gabriele","Braun","MSK Olching e.V.","","","","","",""]
[35365,"Sw 1","Elisabeth","Braun","1. MGC Mannheim 1968 e.V.","","","","","",""]
[20894,"Sm 2","Friedrich","Braun","1. BGC München e.V.","","","","","",""]
[44704,"Sw 2","Brigitte","Braun","1. BGC München e.V.","","","","","",""]
[16823,"H","Achim","Braungart Zink","SG Arheilgen Abt. Bahnengolf","","","","","",""]
[50717,"Sw 2","Ursula","Braungart Zink","Minigolfunion Neviges-Odenthal 1968 e.V.","","","","","",""]
[66419,"H","Julian","Brause","SC Olympia Dortmund e.V.","","","","","",""]
[66418,"Sm 1","Bert","Brause","SC Olympia Dortmund e.V.","","","","","",""]
[46813,"Sm 1","Manfred","Brechelt","MGC Göttingen","Ja","","","","",""]
[34812,"H","Benjamin","Brechtel","MGC Ravensburg-Weingarten e.V.","","","","","",""]
[26565,"Sm 1","Kurt","Breckenkamp","MC Tigers Künsebeck","","","","","",""]
[44743,"Sm 1","Stefan","Bredel","MSV Würzburg-Löwenbrücke e.V.","","","","","",""]
[38567,"D","Anika","Breidenbach","MGC Bergisch Gladbach Gierath e.V.","","","","","",""]
[50409,"Sw 2","Maritta","Breier","MGV Ansbach e.V.","","","","","",""]
[37867,"Sw 1","Lydia","Breitbach","BGC Dormagen e.V.","","","","","",""]
[37260,"Sm 2","Jürgen","Breitbach","BGC Dormagen e.V.","","","","","",""]
[67219,"Sm 1","Frank","Breitbarth","SC Olympia Dortmund e.V.","","","","","",""]
[67185,"Sm 1","Johannes ","Breitfeld","MSG Kempten e.V.","","","","","",""]
[36420,"Sm 1","Thomas","Breitkopf","MGSC Wernau e.V.","","","","","",""]
[36939,"H","Alexander","Breitling","BGC Bad Berneck e.V.","","","","","",""]
[31619,"Sm 1","Dieter","Breitling","BGC Bad Berneck e.V.","","","","","",""]
[66722,"Jm","Sami","Breme","BGC Neutraubling e.V.","","","","","",""]
[66723,"Jm","Luca","Breme","BGC Neutraubling e.V.","","","","","",""]
[66903,"Schm","H. Paul","Bremer","BGS Hardenberg-Pötter e.V.","","","","","",""]
[36697,"Sm 1","H. Bernd","Bremer","BGS Hardenberg-Pötter e.V.","","","","","",""]
[31074,"Sm 1","Stephan","Bremicker","MGC Dormagen-Brechten e.V.","","","","","",""]
[42970,"Sw 1","Susanne","Bremicker","MGC Dormagen-Brechten e.V.","","","","","",""]
[66531,"Sm 1","Robert","Brendel","1. MGC Bamberg e.V.","","","","","",""]
[49753,"Sw 2","Monika","Brethack","BGC Kiel West e.V.","","","","","",""]
[38454,"Sm 2","Lothar","Brieger","KSV Baltrum e.V.","","","","","",""]
[28511,"Sm 2","Wolfgang","Briele","BGC Schloß Paffendorf e.V.","","","","","",""]
[37121,"Sm 1","Werner","Briese","MGC Rot-Weiß Wanne-Eickel e.V.","","","","","",""]
[35751,"H","Thorsten","Brille","BGV Backumer Tal Herten e.V.","","","","","",""]
[44142,"Sm 2","Karl-Heinz","Britte","MGC Heven e.V.","","","","","",""]
[36204,"H","Gerrit","Britz","1. KC Homburg-Saar 1967 e.V.","","","","","",""]
[38492,"H","Marcel","Brocks","HMC Büttgen e.V.","","","","","",""]
[38316,"Sm 1","Ralf","Brocks","HMC Büttgen e.V.","","","","","",""]
[38336,"Sm 1","Carsten","Brocks","HMC Büttgen e.V.","","","","","",""]
[66518,"Sm 1","Knut","Brodersen","MGC Brunsbüttel e.V.","","","","","",""]
[3185,"Sm 2","Josef","Brodesser","Kölner Miniatur Golf Club e.V.","","","","","",""]
[66101,"Sw 1","Bettina","Brökemeier","MGC Bad Salzuflen e.V.","","","","","",""]
[33081,"H","Michael","Bromberger","Minigolf Wölfe Rheinstetten 02","","","","","",""]
[29739,"Sm 1","Jörg","Brommer","TG Höchberg von 1862 Bahnengolf e.V.","","","","","",""]
[37051,"Sw 1","Viola","Bronsart","TV Trappenkamp e.V. - Minigolf -","","","","","",""]
[36780,"H","Christopher","Brown","MGV Spandau","","","","","",""]
[29085,"Sm 1","Lars","Brüchert","1. MGC Mainz e.V.","","","","","",""]
[67300,"Sm 2","Peter","Brüchner","1. MGC Mitterteich-Großbüchlberg","","","","","",""]
[67301,"Sw 2","Doris","Brüchner","1. MGC Mitterteich-Großbüchlberg","","","","","",""]
[67303,"H","Rouven","Bruelheide","MGC Bad Salzuflen e.V.","","","","","",""]
[38227,"H","Thorsten","Brunckhorst","MGC Unterschneidheim e.V.","","","","","",""]
[66534,"H","Julian","Brune","MGC Dortmund Syburg e.V.","","","","","",""]
[26815,"Sm 1","Lutz","Brune","1. MGC Ludwigshafen e.V.","","","","","",""]
[31524,"Sm 1","Christoph","Brune","MGC Dortmund Syburg e.V.","","","","","",""]
[46236,"Sm 1","Ralf","Brunner","MSC Bad Godesberg e.V.","","","","","",""]
[61504,"Sm 2","Günther","Brunner","MPF Hardt e.V.","","","","","",""]
[17490,"Sm 2","Otto","Brust","1. MGC Ludwigshafen e.V.","","","","","",""]
[34566,"H","Wolf","Bublitz","BGSC Bochum 1978 e.V.","","","","","",""]
[67103,"D","Julia","Bublitz","BGSC Bochum 1978 e.V.","","","","","",""]
[42777,"Sm 1","Marcus","Bublitz","1. MGC Ludwigshafen e.V.","","","","","",""]
[36012,"H","Sascha","Büchele","MGC Schwaikheim e.V.","","","","","",""]
[51756,"D","Sandra","Buchert","MSC Bensheim-Auerbach e.V.","","","","","",""]
[22165,"Sm 2","Harald","Buchert","MSC Bensheim-Auerbach e.V.","","","","","",""]
[31317,"D","Jennifer","Buchholz","TV Trappenkamp e.V. - Minigolf -","","","","","",""]
[31513,"Sm 1","Ansgar","Buchholz","MGC \"AS\" Witten 1963 e.V.","","","","","",""]
[33955,"Sw 1","Angelika","Buchholz","Preetzer TSV von 1861 e.V. Abt. Minigolf","","","","","",""]
[41296,"Sm 2","Uwe","Buchholz","Preetzer TSV von 1861 e.V. Abt. Minigolf","","","","","",""]
[41297,"Sm 2","Werner","Buchholz","TV Trappenkamp e.V. - Minigolf -","","","","","",""]
[65819,"Sm 2","Horst","Buchner","BSC Ennepetal e.V.","","","","","",""]
[67229,"Schm","Luis","Buchwieser","MSK Olching e.V.","","","","","",""]
[67399,"Schm","Carl","Buchwieser","MSK Olching e.V.","","","","","",""]
[38056,"Sm 2","Felix","Buckentin","MGC Ingolstadt e.V.","","","","","",""]
[29327,"Sm 1","Markus","Büdenbender","1. MSC Wesel 6.6.1966 e.V.","","","","","",""]
[34106,"Sm 2","Dietmar","Bühner","MGC Nümbrecht e.V.","","","","","",""]
[29448,"H","Markus","Buknakowski","MGC Lohfelden","Ja","","","","",""]
[34974,"H","Paul","Bunse","1. BGC Paderborn e.V.","","","","","",""]
[44445,"Sm 1","Oliver","Burde","VfM Bottrop e.V.","","","","","",""]
[38584,"H","Yannick","Burdorf","MC Tigers Künsebeck","","","","","",""]
[5758,"Sm 2","Jürgen","Burgard","Freizeit Club Bliesen e.V.","","","","","",""]
[38436,"Jm","Norman","Burgdorf","BGC Wolfsburg","Ja","","","","",""]
[40281,"Sm 1","Harald","Burger","1. MGC Ludwigshafen e.V.","","","","","",""]
[37227,"Sw 1","Gabriele","Burger","1. MGC Ludwigshafen e.V.","","","","","",""]
[45219,"Sm 1","Michael","Burk","MGC Millennium Lorsch e.V.","","","","","",""]
[65508,"Sm 2","Dieter","Burkart","BSV Inzlingen 1979 e.V.","","","","","",""]
[1951,"Sm 1","Michael","Burkert","MGF Magdeburg 1995 e.V.","","","","","",""]
[38135,"Sw 1","Sabine Monika","Burkert","MGF Magdeburg 1995 e.V.","","","","","",""]
[34305,"Sw 2","Renate","Burkert","MGV Bremen","Ja","","","","",""]
[43821,"Sm 2","Peter","Burkhart","MSV Bad Kreuznach","","","","","",""]
[44916,"Sw 2","Roswitha","Burkhart","MSV Bad Kreuznach","","","","","",""]
[29268,"Sm 1","Manfred","Burmeister","MGC Brunsbüttel e.V.","","","","","",""]
[19315,"Sm 2","Wolfgang","Burmester","MGC Bad Oldesloe e.V.","","","","","",""]
[45253,"D","Simona","Busch","BGC Goslar","Ja","19072","","X","",""]
[913,"Jw","Christin Sophie","Busch","BGC Goslar","Ja","","","","",""]
[46026,"Sm 1","Michael","Busch","BGC Wolfsburg","Ja","19553","","X","",""]
[10586,"Sm 2","Philip","Busche","MGC Göttingen","Ja","5463","X","","",""]
[3990,"Sm 2","Rolf","Büscher","MGC Heven e.V.","","","","","",""]
[66814,"H","Daniel","Buser","MGC Unterschneidheim e.V.","","","","","",""]
[66328,"Sm 1","Peter","Büsgen","Kölner Miniatur Golf Club e.V.","","","","","",""]
[33859,"H","Patrick","Buske","MC Tigers Künsebeck","","","","","",""]
[33860,"H","Pascal","Buske","MC Tigers Künsebeck","","","","","",""]
[35144,"Sm 1","Jürgen","Butkereit","MGC Traben-Trarbach","","","","","",""]
[37600,"Sm 2","Erwin","Butscher","BGC Dormagen e.V.","","","","","",""]
[23731,"H","Sebastian","Butter","SC Bastion Rot Weiß Lippstadt e.V.","","","","","",""]
[47424,"Sw 1","Heidrun","Butter","SC Bastion Rot Weiß Lippstadt e.V.","","","","","",""]
[47421,"Sm 2","Rolf","Butter","SC Bastion Rot Weiß Lippstadt e.V.","","","","","",""]
[33659,"H","Alexander","Büttner","MGF Hammer e.V.","","","","","",""]
[40888,"H","Torben","Bychowski","MGC Harrislee-Wassersleben","","","","","",""]
[5015,"Sm 2","Raffaele","Canceniella","Miniaturgolf Sportclub Schriesheim e.V","","","","","",""]
[37789,"Sm 2","Gerhard","Caspar","MSV Bad Kreuznach","","","","","",""]
[67171,"Sw 1","Marina","Casu","MGC Ingolstadt e.V.","","","","","",""]
[66852,"Sm 1","Andree","Cech","BGSV Aßlar 1987 e.V.","","","","","",""]
[67048,"H","Marc","Cervinca","1. BGC Bad Füssing e.V.","","","","","",""]
[66543,"Sm 2","Bernd","Chabowski","MGV Bremen","Ja","","","","",""]
[40415,"Sm 1","Oliver","Christ","Niendorfer MC","","","","","",""]
[44409,"Sm 1","Daniel","Christ","MGC Olympia Kiel e.V.","","","","","",""]
[46852,"Sm 2","Michael","Christ","MGC Brunsbüttel e.V.","","","","","",""]
[35102,"D","Ramona","Christiansen","MC Flora Elmshorn e.V.","","","","","",""]
[65894,"Sm 1","Thomas","Christmann","BGC Bildstock e.V.","","","","","",""]
[65895,"Sw 1","Steffi","Christmann","BGC Bildstock e.V.","","","","","",""]
[36650,"Sm 2","Gerhard","Chrobock","MGC Einbeck","Ja","","","","",""]
[67385,"Sw 2","Marion","Ciachera","1. Minigolf-Club Rheinhausen e.V.","","","","","",""]
[66086,"Sm 2","Edmund","Cieslik","BGC Celle","Ja","","","","",""]
[12431,"Sw 2","Marlies","Citi","KGC  Waldstadion Frankfurt am Main","","","","","",""]
[40407,"Sm 1","Tim","Clasen","BGC Wolfsburg","Ja","","","","",""]
[48980,"H","Jan","Clemens","MGC Marl 1960 e.V.","","","","","",""]
[66680,"Schw","Aylin","Clemens","MGC Marl 1960 e.V.","","","","","",""]
[66681,"Schw","Leni","Clemens","MGC Marl 1960 e.V.","","","","","",""]
[45741,"Sw 1","Isabella","Clemens","MGC Marl 1960 e.V.","","","","","",""]
[66336,"Sm 2","Herbert","Cöln","BGC Schloß Paffendorf e.V.","","","","","",""]
[67129,"Sw 2","Gertrud","Cöln","BGC Schloß Paffendorf e.V.","","","","","",""]
[66491,"Sm 1","Marco","Corinth","1. MGC Gelsenkirchen e.V.","","","","","",""]
[36820,"H","Daniel","Cortese","1. MGC Paderborn e.V.","","","","","",""]
[34521,"Sm 2","Dieter","Crass","HMC Büttgen e.V.","","","","","",""]
[34693,"Sw 2","Annegret","Crass","HMC Büttgen e.V.","","","","","",""]
[65843,"H","Yannick","Crettat","MGC Bad Homburg vdH e.V.","","","","","",""]
[44877,"Sm 1","Harm","Croppenstedt","Tempelhofer MV Berlin e.V.","","","","","",""]
[44760,"Sw 2","Ursula","Crößmann","1. MGC Ludwigshafen e.V.","","","","","",""]
[49136,"Sm 1","Michael","Czernoch","MSC Blau-Weiß 2003 München e.V.","","","","","",""]
[21335,"Sm 2","Hans-Dirk","Czerwek","MSC Bensheim-Auerbach e.V.","","","","","",""]
[31967,"D","Tanja","Czeslik","1. MGC Saar 68 St. Ingbert e.V.","","","","","",""]
[38448,"H","Tim","Dachwald","SV Lurup Abt. Bahnengolf","","","","","",""]
[49479,"Sm 1","Andreas","Dageförde","1. MGC Metzingen e.V.","","","","","",""]
[37817,"D","Denise","Dahl","SSC Halver e.V.","","","","","",""]
[9710,"Sm 1","Roland","Dahl","1. KC Homburg-Saar 1967 e.V.","","","","","",""]
[66399,"Sm 2","Matthias","Dahrendorf","SV Lurup Abt. Bahnengolf","","","","","",""]
[66398,"Sw 2","Petra","Dahrendorf","SV Lurup Abt. Bahnengolf","","","","","",""]
[67263,"Schm","Mazen","Dallah","TSV Kücknitz Abt. Bahnengolf","","","","","",""]
[66729,"H","Christian","Damaschke","MGV Bremen","Ja","","","","",""]
[25732,"Sm 2","Reinhold","Dammann","MGC \"AS\" Witten 1963 e.V.","","","","","",""]
[30625,"Sm 1","Andreas","Dams","MGC Felderbachtal 1964 e.V.","","","","","",""]
[65441,"Sw 1","Tanja","Dams","MGC Felderbachtal 1964 e.V.","","","","","",""]
[45297,"Sm 2","Michael","Dassek","SC Olympia Dortmund e.V.","","","","","",""]
[33194,"Sm 1","Jürgen","Daub","Miniaturgolf Sportclub Schriesheim e.V","","","","","",""]
[66244,"H","Jan","Daubertshäuser","SSC Halver e.V.","","","","","",""]
[5325,"Sw 2","Christa","Daukant","MSV Bad Kreuznach","","","","","",""]
[67052,"Jm","Max Werner","Daumann","1. FMGC Lichtenfels 1961 e.V.","","","","","",""]
[33904,"H","Thomas","Dautert","BGV Backumer Tal Herten e.V.","","","","","",""]
[35731,"Sm 2","Patrick","Debes","MPF Hardt e.V.","","","","","",""]
[36109,"D","Sabine","Deck","SG Arheilgen Abt. Bahnengolf","","","","","",""]
[40091,"Sw 2","Monika","Deck","SG Arheilgen Abt. Bahnengolf","","","","","",""]
[48691,"Sm 1","Jochen","Dedeleit","MGC Friedrichshafen e.V.","","","","","",""]
[37856,"H","Martin","Deeg","MGC Unterschneidheim e.V.","","","","","",""]
[43691,"Sm 1","Thomas","Deepen","BGC Goslar","Ja","","","","",""]
[33673,"Sm 2","Joachim","Dehne","1. BGC Paderborn e.V.","","","","","",""]
[66969,"H","Benjamin","Deicke","BGC Hannover","Ja","","","","",""]
[40916,"Sm 1","Stefan","Deider","Reinickendorfer MGC e.V.","","","","","",""]
[4752,"Sm 2","Ottmar","Deißner","1. MGC Mannheim 1968 e.V.","","","","","",""]
[64989,"H","Rene","Dejoks","BGC Diepholz","Ja","24675","","","",""]
[66016,"Sm 1","Christian","Delasbe","MSG Kempten e.V.","","","","","",""]
[66055,"Sw 1","Barbara","Delasbe","MSG Kempten e.V.","","","","","",""]
[6264,"Sm 2","Karl-Heinz","Dellinger","MSC Bensheim-Auerbach e.V.","","","","","",""]
[38260,"D","Annika","Dellmann","MSK Neheim-Hüsten e.V.","","","","","",""]
[21501,"Sm 1","Christoph","Dellmann","MSK Neheim-Hüsten e.V.","","","","","",""]
[66452,"Sm 1","Marko","Depke","MGC Bad Salzuflen e.V.","","","","","",""]
[10759,"Sm 2","Wolfgang","Detering","MGC Bad Salzuflen e.V.","","","","","",""]
[32810,"Sm 2","Heinz-Werner","Detlof","BGC Hannover","Ja","","","","",""]
[33311,"Sw 2","Maren","Detlof","BGC Hannover","Ja","11420","","","","X"]
[196,"Sm 1","Peter","Dettmer","VfB Osnabrück e.V.","","","","","",""]
[66085,"Jm","Erik","Dettmer-Melendez","BGV Backumer Tal Herten e.V.","","","","","",""]
[38478,"H","Philip","Deutschmann","BGV Backumer Tal Herten e.V.","","","","","",""]
[42308,"Sm 1","Uwe","Dewor","KGC Bad Urach e.V.","","","","","",""]
[26146,"Sm 1","Uwe","Deya","MGC Bad Hersfeld","","","","","",""]
[67349,"Sm 2","Alfons","Dhombruch","1. MGC Ludwigshafen e.V.","","","","","",""]
[67350,"Sw 2","Verena","Dhombruch","1. MGC Ludwigshafen e.V.","","","","","",""]
[67084,"H","Stefan","Dickert","1. CGC Rot-Weiß Groß-Umstadt e.V.","","","","","",""]
[38141,"Jm","Robin","Dickes","MSK Neheim-Hüsten e.V.","","","","","",""]
[50770,"Sm 1","Michael","Diedrich","1. MGC Gelsenkirchen e.V.","","","","","",""]
[28955,"Sm 2","Rainer","Diehl","MSC Bensheim-Auerbach e.V.","","","","","",""]
[35653,"Sm 2","Norbert","Diehm","2. MGC Worms","","","","","",""]
[66031,"H","Julian","Diener","BGC Northeim","Ja","","","","",""]
[66030,"H","Manuel","Diener","BGC Hannover","Ja","","","","",""]
[67111,"Sm 1","Frank","Diener","MSC Bad Godesberg e.V.","","","","","",""]
[67401,"Schm","Marcel","Dierks","MC Georgsmarienhütte e.V.","","","","","",""]
[46670,"Sm 2","Wolfgang","Dietenberger","MSG Kempten e.V.","","","","","",""]
[67290,"Schm","Fabian","Dietz","MGC Heringen 1997 e.V.","","","","","",""]
[5745,"Sm 2","Gerhard","Dietzel","MGC Felderbachtal 1964 e.V.","","","","","",""]
[10953,"Sw 2","Veronika","Dietzel","MGC Felderbachtal 1964 e.V.","","","","","",""]
[37963,"H","Anton","Dillinger","Tempelhofer MV Berlin e.V.","","","","","",""]
[36175,"D","Anne","Dippel","Reinickendorfer MGC e.V.","","","","","",""]
[34451,"Sm 1","Markus","Dippelhofer","1. MGC Mannheim 1968 e.V.","","","","","",""]
[45139,"Sm 1","René","Dippelhofer","1. MGC Mainz e.V.","","","","","",""]
[45161,"H","Christian","Dirksmeyer","1. MGC Epe 1978 e.V.","","","","","",""]
[63588,"H","Dennis","Dirlmeier","BGC Neutraubling e.V.","","","","","",""]
[38329,"Sm 1","Michael","Dittrich","MGC putter Künzell 1970 e.V.","","","","","",""]
[35097,"D","Renate","Djezri","MSV Würzburg-Löwenbrücke e.V.","","","","","",""]
[67227,"Schm","Derrick","Dobberstein","BGC Illertissen e.V.","","","","","",""]
[51818,"H","Tobias","Dochat","BGV Bergisch Land 1962 / 63 e.V.","","","","","",""]
[42787,"Sw 1","Britta","Dohmen","BGC Uerdingen e.V.","","","","","",""]
[29548,"Sm 2","Stefan","Döhner","Preetzer TSV von 1861 e.V. Abt. Minigolf","","","","","",""]
[746,"Sm 1","Uwe","Dohrmann","MGC Göttingen","Ja","","","","",""]
[66868,"D","Marie-Theres","Dolch","1. CGC Rot-Weiß Groß-Umstadt e.V.","","","","","",""]
[30207,"Sm 2","Peter","Dolch","1. CGC Rot-Weiß Groß-Umstadt e.V.","","","","","",""]
[25887,"Sm 2","Dietmar","Dolde","1. MGC Metzingen e.V.","","","","","",""]
[67199,"Sw 1","Silke","Doll","BGSV Bad Homburg","","","","","",""]
[36907,"Sm 2","Fred","Doll","VfL Lüneburg","Ja","","","","",""]
[49414,"H","Markus","Dolp","BGC Illertissen e.V.","","","","","",""]
[60120,"Sm 2","Jochen","Donath","1. Münchener MGC e.V.","","","","","",""]
[5240,"Sw 2","Brigitte","Donnig","SG  Weiterstadt 1886 e.V.","","","","","",""]
[6905,"Sm 2","Heinz","Donsbach","MSC Bad Godesberg e.V.","","","","","",""]
[35718,"D","Piroschka","Dorfmeister","MGC Felderbachtal 1964 e.V.","","","","","",""]
[66811,"H","Matthias","Dörheit","Elbhavelland e.V., Abt. Minigolfsport","","","","","",""]
[44395,"H","Kai","Dorner","MGC Dormagen-Brechten e.V.","","","","","",""]
[38012,"Jm","Kevin","Dornick","1. MGC Ludwigshafen e.V.","","","","","",""]
[38011,"Sm 1","Jochen","Dornick","1. MGC Ludwigshafen e.V.","","","","","",""]
[38013,"Sw 1","Zita","Dornick","1. MGC Ludwigshafen e.V.","","","","","",""]
[66213,"H","Werner","Dosch","MC Ilvesheim e.V.","","","","","",""]
[33733,"Sm 1","Michael","Dostert","MSC Bad Godesberg e.V.","","","","","",""]
[46210,"Sw 2","Ulrike","Dowidat","1. MGC Köln 1961 e.V.","","","","","",""]
[67238,"Schm","Lucas","Draber","1. FMGC Lichtenfels 1961 e.V.","","","","","",""]
[36775,"Sm 2","Horst","Drautzburg","Minigolfunion Neviges-Odenthal 1968 e.V.","","","","","",""]
[37864,"Sm 1","Erich","Drebert","SG  Weiterstadt 1886 e.V.","","","","","",""]
[66163,"Sw 2","Clementine","Drebert","SG  Weiterstadt 1886 e.V.","","","","","",""]
[46964,"Sm 2","Klaus-Dieter","Drechsler","BGC Uerdingen e.V.","","","","","",""]
[5717,"Sm 2","Hans","Dreger","SV 1890 e.V. Dreieichenhain, Abt. Bahnengolf","","","","","",""]
[23778,"Sm 2","Burkhard","Dreischer","SC Olympia Dortmund e.V.","","","","","",""]
[26505,"Sm 2","Gerd","Drenkelforth","SC Olympia Dortmund e.V.","","","","","",""]
[4510,"Sm 2","Manfred","Drescher","MGC Wetzlar e.V.","","","","","",""]
[36519,"Sm 2","Kurt","Dresel","MGC Ingolstadt e.V.","","","","","",""]
[35132,"H","Daniel","Drewes","MGC putter Künzell 1970 e.V.","","","","","",""]
[6203,"Sm 2","Horst","Dreyer","VfL Lüneburg","Ja","4862","","X","","X"]
[67252,"Sm 2","Alfons","Driemel","MGC Bad Waldsee 1990 e.V.","","","","","",""]
[65719,"Sm 1","Andreas","Drobik","BGC Bremen","Ja","27074","X","","",""]
[65720,"Sw 1","Kerstin","Drobik","MGV Bremen","Ja","","","","",""]
[66043,"Sm 1","Peter","Droste","BGSV Bad Homburg","","","","","",""]
[66152,"Sm 2","Günter","Drostel","1. Minigolf-Club Rheinhausen e.V.","","","","","",""]
[36524,"H","Sebastian","Dudenhöffer","BSV Inzlingen 1979 e.V.","","","","","",""]
[43595,"Sm 1","Jürgen","Duensing","BGC Diepholz","Ja","","","","",""]
[65469,"Sm 1","Norbert","Dullau","1. MGC Gelsenkirchen e.V.","","","","","",""]
[3826,"Sm 2","Winfried","Dümmler","1. KC Homburg-Saar 1967 e.V.","","","","","",""]
[67108,"H","Michael","Dunkel","1. BGC Landshut e.V.","","","","","",""]
[37832,"H","Sven","Dunker","VfB Osnabrück e.V.","","","","","",""]
[18014,"Sm 2","Klaus","Dunker","SSC Halver e.V.","","","","","",""]
[43951,"Sw 2","Heike","Dunker","SSC Halver e.V.","","","","","",""]
[38529,"Sm 1","Ralf","Durm","BGC Bildstock e.V.","","","","","",""]
[47022,"Sm 1","Thomas","Dürr","TV Niederstetten 1862 e.V.  Abt. Minigolf","","","","","",""]
[61825,"Sm 2","Otto","Duzella","SGC Hagen e.V.","","","","","",""]
[65904,"H","Marc Anthony","Dzäbel","BGC Goslar","Ja","","","","",""]
[65906,"H","Christopher","Dzäbel","BGC Goslar","Ja","","","","",""]
[65903,"Sm 1","Ralf","Dzäbel","BGC Goslar","Ja","","","","",""]
[65905,"Sw 1","Gregoria","Dzäbel","BGC Goslar","Ja","","","","",""]
[66844,"Sm 1","Siegbert","Eberhardt","BG Pfullingen","","","","","",""]
[36496,"H","Nick-Manuel","Eberle","MGC Rot-Weiß Wanne-Eickel e.V.","","","","","",""]
[45272,"Sm 2","Alfred","Ebert","BGS Hardenberg-Pötter e.V.","","","","","",""]
[26534,"Sm 1","Robert","Ebi","MGF Hilzingen 80 e.V.","","","","","",""]
[46087,"Sm 1","Hans-Joachim","Eckerle","1. BGC Paderborn e.V.","","","","","",""]
[36468,"H","Manuel","Eckert","1. KC Homburg-Saar 1967 e.V.","","","","","",""]
[66203,"H","Philipp","Eckert","BGC Heilbronn e.V.","","","","","",""]
[62030,"Sm 2","Horst","Eckloff","MGC Olympia Kiel e.V.","","","","","",""]
[66495,"Sm 2","Helmut","Eckstein","MGC Wolnzach e.V.","","","","","",""]
[66496,"Sw 2","Sonja","Eckstein","MGC Wolnzach e.V.","","","","","",""]
[27480,"Sm 1","Jürgen","Edelmann","BGC Heilbronn e.V.","","","","","",""]
[38404,"Sw 1","Gina","Edsen","MGC Harrislee-Wassersleben","","","","","",""]
[67312,"Sw 1","Cornelia","Effenberger","MGC Bad Homburg vdH e.V.","","","","","",""]
[67313,"Sm 2","Thomas","Effenberger","MGC Bad Homburg vdH e.V.","","","","","",""]
[23923,"Sm 2","Helmut","Efinger","HMC Büttgen e.V.","","","","","",""]
[46406,"Sm 1","Hans-Jürgen","Egger","BGC Neutraubling e.V.","","","","","",""]
[4181,"Sm 2","Erich","Egger","MC Ilvesheim e.V.","","","","","",""]
[18298,"Sw 2","Irene","Egger","MC Ilvesheim e.V.","","","","","",""]
[48601,"Sm 2","Gerd","Ehlebracht","1. BGC Paderborn e.V.","","","","","",""]
[34426,"H","Sascha","Ehlers","MGC Peine","Ja","","","","",""]
[33996,"Sm 2","Ulrich","Ehlert","HMC Büttgen e.V.","","","","","",""]
[34006,"H","Christoph","Ehm","BGC Celle","Ja","","","","",""]
[35737,"D","Jasmin","Ehm","MGC Göttingen","Ja","","","","",""]
[46898,"Sw 1","Marion","Ehm","BGC Celle","Ja","","","","",""]
[34315,"Sm 1","Josef","Ehrenberg","MGC \"Stahlquelle\" Bad Bocklet","","","","","",""]
[3634,"Sw 2","Gerda","Ehresmann","1. MGC Ludwigshafen e.V.","","","","","",""]
[30000,"Sm 2","Volkmar","Ehrhardt","BGC Celle","Ja","","","","",""]
[67144,"Schw","Gina","Ehrich","SV Lurup Abt. Bahnengolf","","","","","",""]
[29692,"H","Steffen","Ehrlich","BGC Neutraubling e.V.","","","","","",""]
[44758,"Sm 1","Marcus","Ehrlich","KGC  Waldstadion Frankfurt am Main","","","","","",""]
[66759,"Sm 1","Maximilian","Ehrnstraßer","MGC Ingolstadt e.V.","","","","","",""]
[21680,"Sm 2","Karl-Heinz","Eichert","1. MGC Ladenburg e.V.","","","","","",""]
[66259,"Sw 2","Bärbel","Eichhof","MGC Bad Salzuflen e.V.","","","","","",""]
[20044,"Sm 2","Herbert","Eichhorn","MSV Bad Kreuznach","","","","","",""]
[29197,"Sm 2","Joachim","Eichhorn","1. MGC Mainz e.V.","","","","","",""]
[33707,"H","Marco","Eigenbrod","SG Arheilgen Abt. Bahnengolf","","","","","",""]
[49368,"Sm 2","Norbert","Eilert","VfM Bottrop e.V.","","","","","",""]
[49367,"Sw 2","Sigrid","Eilert","VfM Bottrop e.V.","","","","","",""]
[31727,"Sw 2","Frauke","Eilts","MSK Olching e.V.","","","","","",""]
[67308,"Sm 2","Jost-Ulrich","Eimer","MGC Nümbrecht e.V.","","","","","",""]
[36867,"Sw 1","Sabine","Eisele","MGF Steinbruch Kempten","","","","","",""]
[48283,"Sm 2","Dominikus","Eisele","MGF Steinbruch Kempten","","","","","",""]
[67376,"Sm 2","Hans","Eisen","Minigolf-Club Diessen","","","","","",""]
[40364,"Sm 1","Peter","Eisenberger","OMGC Ingolstadt e.V.","","","","","",""]
[34412,"Sm 2","Hans-Dieter","Eiserfey","1. BGC Wesseling 1975 e.V.","","","","","",""]
[24693,"Sm 1","Bernd","Eisermann","MGC \"AS\" Witten 1963 e.V.","","","","","",""]
[35449,"Sm 2","Dirk","Eisleben","BGC Schloß Paffendorf e.V.","","","","","",""]
[4338,"Sw 2","Elfriede","Ekholm","Miniaturgolf Sportclub Schriesheim e.V","","","","","",""]
[49246,"H","Karim","El Gharbi","MSV Bad Kreuznach","","","","","",""]
[47500,"H","Markus","Elbe","MGC 1978 Remseck e.V.","","","","","",""]
[27492,"D","Karin","Elbe","MGC 1978 Remseck e.V.","","","","","",""]
[29690,"H","Jörg","Elbert","MGC Rot-Weiß Wanne-Eickel e.V.","","","","","",""]
[38449,"H","Nikolei","Elich","SV Lurup Abt. Bahnengolf","","","","","",""]
[28184,"H","Tim","Eller","TSV Pfungstadt Abt. Bahnengolf e.V.","","","","","",""]
[67217,"Sm 2","Klaus-Martin","Ellerbrock","MGC Felderbachtal 1964 e.V.","","","","","",""]
[35197,"Sm 1","Harry","Ellhoff","MGC Peine","Ja","","","","",""]
[37837,"Sm 2","Gerald","Elliot","MGC Bad Homburg vdH e.V.","","","","","",""]
[48907,"Sm 1","Thomas","Elmer","Minigolfunion Neviges-Odenthal 1968 e.V.","","","","","",""]
[45330,"Sm 1","Robert","Elst","1. MGC Bamberg e.V.","","","","","",""]
[66974,"Sw 1","Michaela","Emich","1. MC Weinheim e.V.","","","","","",""]
[66975,"Sm 2","Peter","Emich","1. MC Weinheim e.V.","","","","","",""]
[38419,"H","Tim","Emmendörffer","MGC Rot-Weiß Wanne-Eickel e.V.","","","","","",""]
[67247,"D","Brigitte","Emmerich","MGV Ansbach e.V.","","","","","",""]
[67131,"D","Sina","Emmerich","BGC Bildstock e.V.","","","","","",""]
[67246,"Schw","Lea","Emmerich","MGV Ansbach e.V.","","","","","",""]
[67201,"Schw","Lilly","Emmerich","BGC Bildstock e.V.","","","","","",""]
[67329,"H","David","Emuze","Minigolfclub Karlshagen e.V.","","","","","",""]
[67328,"Schm","Thabo","Emuze","Minigolfclub Karlshagen e.V.","","","","","",""]
[17861,"Sm 2","Heinrich","Endres","1. FMGC Lichtenfels 1961 e.V.","","","","","",""]
[5082,"Sw 2","Hannelore","Endres","1. FMGC Lichtenfels 1961 e.V.","","","","","",""]
[67402,"Schm","Jonas","Endter","BGC Leipzig","","","","","",""]
[31683,"Sm 2","Wolfgang","Engel","MGC Monrepos e.V.","","","","","",""]
[41719,"H","Jens","Engelbracht","SC Olympia Dortmund e.V.","","","","","",""]
[31082,"D","Anika","Engelbracht","SC Olympia Dortmund e.V.","","","","","",""]
[1359,"Sm 2","Uwe","Engelmann","MGC Peine","Ja","2924","","X","",""]
[61068,"Sm 2","Klaus","Engels","MGC Rot-Weiß Wanne-Eickel e.V.","","","","","",""]
[41246,"Sm 1","Thomas","Engesser","MGF Hilzingen 80 e.V.","","","","","",""]
[67259,"D","Solveig Manuela Akiko","Enke","BGC Goslar","Ja","","","","",""]
[67260,"D","Nicole","Enke","BGC Goslar","Ja","","","","",""]
[33460,"Sm 2","Heiner","Entelmann","MGV Bremen","Ja","","","","",""]
[45061,"H","Sven","Eresch","Miniaturgolf Sportclub Schriesheim e.V","","","","","",""]
[4408,"Sm 2","Wolfgang","Erfurth","TV Trappenkamp e.V. - Minigolf -","","","","","",""]
[35788,"Sm 1","Wolfram","Erhard","BGC Rheinau-Freistett e.V.","","","","","",""]
[28046,"Sw 1","Isolde","Erhard","BGC Rheinau-Freistett e.V.","","","","","",""]
[30972,"H","Florian","Erhart","1. BGC Landshut e.V.","","","","","",""]
[65947,"Sm 1","Matthias","Erhart","BGC Bremen","Ja","27673","X","","",""]
[28515,"H","Harald","Erlbruch","BGS Hardenberg-Pötter e.V.","","","","","",""]
[42994,"Sm 1","Walter","Erlbruch","BGS Hardenberg-Pötter e.V.","","","","","",""]
[23579,"Sw 2","Monika","Erlbruch","BGC Hannover","Ja","","","","",""]
[65927,"Sm 1","Klaus","Ernst","1. BGC Wesseling 1975 e.V.","","","","","",""]
[67163,"Sw 1","Petra","Ernst","1. BGC Wesseling 1975 e.V.","","","","","",""]
[42527,"Sm 1","Wolfgang","Ernstberger","1. MGC Mitterteich-Großbüchlberg","","","","","",""]
[40033,"Sw 2","Elisabeth","Ernstberger","1. MGC Mitterteich-Großbüchlberg","","","","","",""]
[64551,"H","Daniel","Ertl","OMGC Ingolstadt e.V.","","","","","",""]
[63843,"Sm 1","Reinhold","Ertl","1. BGC Landshut e.V.","","","","","",""]
[65623,"Sw 1","Johanna ","Ertl","1. BGC Landshut e.V.","","","","","",""]
[28086,"H","Dirk","Eschmann","1. MGC Ludwigshafen e.V.","","","","","",""]
[49300,"Sm 2","Jürgen","Eschmann","1. MGC Mainz e.V.","","","","","",""]
[29883,"Sm 1","Gerd","Esser","1.KGC Mönchengladbach e.V.","","","","","",""]
[12305,"Sm 2","Horst","Esser","BGC Uerdingen e.V.","","","","","",""]
[61555,"Sm 2","Gerhard","Essig","1. Münchener MGC e.V.","","","","","",""]
[36551,"H","Christian","Essler","1. Duisburger Minigolf Club 1962 e.V.","","","","","",""]
[65940,"H","Alessandro","Essler","1. Duisburger Minigolf Club 1962 e.V.","","","","","",""]
[37718,"Sm 1","Ferdinand","Essler","1. Duisburger Minigolf Club 1962 e.V.","","","","","",""]
[36421,"Sw 1","Ingeborg","Essler","1. Duisburger Minigolf Club 1962 e.V.","","","","","",""]
[60515,"Sm 2","Peter","Etienne","MC 62 Lüdenscheid e.V.","","","","","",""]
[67271,"Sm 2","Klaus-Dieter","Ewert","BSG Pneumant Fürstenwalde e.V., Abt. Minigolf","","","","","",""]
[27708,"Sw 2","1Karin","Exel","1. Berliner Miniaturgolf-Sportclub e.V. 1960","","","","","",""]
[66174,"Sw 1","Petra","Exner","Elbhavelland e.V., Abt. Minigolfsport","","","","","",""]
[40821,"Sw 1","Karin","Exner","SSC Halver e.V.","","","","","",""]
[42435,"Sm 2","Frank","Exner","SSC Halver e.V.","","","","","",""]
[30064,"Sm 1","Holger","Fabry","MGC Göttingen","Ja","","","","",""]
[33157,"H","Nils","Fabrytzek","BGC Goslar","Ja","","","","",""]
[28892,"Sw 1","Kirsten","Fahrenkrog","Niendorfer MC","","","","","",""]
[67070,"Jm","Florian","Fahsel","MGV Eibenstock","","","","","",""]
[33459,"H","Felix","Falge","VfB Osnabrück e.V.","","","","","",""]
[66478,"H","Martin","Fallenbüchel","Miniaturgolf Sportclub Schriesheim e.V","","","","","",""]
[35374,"Sw 2","Christel","Fander","1.KGC Mönchengladbach e.V.","","","","","",""]
[38528,"Sm 1","Markus","Faßbender","HMC Büttgen e.V.","","","","","",""]
[40560,"Sm 1","Thomas","Fassl","MGC Sulzfeld e.V.","","","","","",""]
[67181,"Sw 2","Christine","Faulhaber","Minigolf-Club Diessen","","","","","",""]
[50859,"H","Sascha","Faust","MGC Rot-Weiß Wanne-Eickel e.V.","","","","","",""]
[48058,"D","Monika","Faust","MSC Bensheim-Auerbach e.V.","","","","","",""]
[40148,"Sw 2","Gabriele","Faust","MSC Bensheim-Auerbach e.V.","","","","","",""]
[37734,"Sw 1","Karin","Fechter","1. MGC Hechingen","","","","","",""]
[37733,"Sm 2","Dieter","Fechter","1. MGC Hechingen","","","","","",""]
[40328,"Sm 2","Wolfgang","Federici","MGF Hilzingen 80 e.V.","","","","","",""]
[34871,"Sm 1","Volker","Feld","1. KC Homburg-Saar 1967 e.V.","","","","","",""]
[33710,"H","Torsten","Fellenberg","TSV Salzgitter","Ja","","","","",""]
[33711,"D","Kerstin","Fellenberg","MGC Peine","Ja","11819","","X","",""]
[34721,"Sw 2","Christa","Fellenberg","MGC Peine","Ja","","","","",""]
[45697,"Sm 1","Thomas","Fellmann","BGV Bergisch Land 1962 / 63 e.V.","","","","","",""]
[38610,"Sw 1","Prisca","Ferstl","MGC Murnau am Staffelsee e.V.","","","","","",""]
[27873,"Sw 1","Christine","Feucht","1. Bahnengolf-Club Singen e.V.","","","","","",""]
[28740,"Sm 2","Dieter","Fiedler","VfL Lohbrügge Abt. Bahnengolf","","","","","",""]
[67059,"Sm 2","Wolfgang","Fiedler","MGC Heringen 1997 e.V.","","","","","",""]
[66695,"Sm 2","Andreas","Filgertshofer","Minigolf-Club Diessen","","","","","",""]
[4917,"Sm 2","Wolfgang","Findewirth","VfM e.V. Berlin ","","","","","",""]
[48999,"Sm 1","Manfred","Finette","MSC Bad Godesberg e.V.","","","","","",""]
[33123,"H","Moritz","Fingerle","MSK Olching e.V.","","","","","",""]
[66393,"Schm","Jonas","Fink","BGV Backumer Tal Herten e.V.","","","","","",""]
[1472,"H","Nikolas","Finsterer-Robnik","BGC Illertissen e.V.","","","","","",""]
[50426,"Sm 1","Ralf","Fischbach","MSV Bad Kreuznach","","","","","",""]
[38177,"D","Patricia","Fischbeck","Reinickendorfer MGC e.V.","","","","","",""]
[37509,"H","Christoph","Fischer","Niendorfer MC","","","","","",""]
[38560,"H","Lukas","Fischer","BGSV Castrop e.V. 1961","","","","","",""]
[37628,"D","Katharina","Fischer","1. Porzer MGC Grün-Weiß 1969 e.V.","","","","","",""]
[64495,"Jm","Kai-Erik","Fischer","MGC Kassel","Ja","","","","",""]
[38334,"Jw","Alexandra","Fischer","1. Porzer MGC Grün-Weiß 1969 e.V.","","","","","",""]
[40638,"Sm 1","Manfred","Fischer","MGF Ottobrunn e.V.","","","","","",""]
[43587,"Sm 1","Marcus","Fischer","MGC Kassel","Ja","","","","",""]
[66574,"Sm 1","Frank","Fischer","MTV Seesen","Ja","","","","",""]
[37008,"Sm 1","Robert","Fischer","BGSV Kerpen e.V.","","","","","",""]
[43000,"Sm 1","Frank","Fischer","1. Porzer MGC Grün-Weiß 1969 e.V.","","","","","",""]
[49979,"Sm 1","Walter","Fischer","1. MGC Paderborn e.V.","","","","","",""]
[25512,"Sm 1","Gerd","Fischer","1. MGC Süßen e.V.","","","","","",""]
[43588,"Sw 1","Astrid","Fischer","MGC Kassel","Ja","18087","X","","",""]
[30855,"Sw 1","Susanne","Fischer","1. Porzer MGC Grün-Weiß 1969 e.V.","","","","","",""]
[48906,"Sw 1","Annette","Fischer","Minigolfunion Neviges-Odenthal 1968 e.V.","","","","","",""]
[66628,"Sm 2","Dirk","Fischer","BGV Backumer Tal Herten e.V.","","","","","",""]
[49978,"Sw 2","Heidi","Fischer","1. MGC Paderborn e.V.","","","","","",""]
[6768,"Sw 2","Heidi","Fischer","SSV Ulm 1846 Abt. Bahnengolf","","","","","",""]
[66900,"H","Marco","Flick","Kölner Miniatur Golf Club e.V.","","","","","",""]
[4330,"Sm 2","Peter","Flick","BGC Bildstock e.V.","","","","","",""]
[66687,"H","Hans","Flohe","MSC Bad Godesberg e.V.","","","","","",""]
[51799,"Sm 1","Peter","Flohrschütz","BGC Schweinfurt e.V.","","","","","",""]
[66876,"Sm 1","Detlef","Flotin","BGC Dormagen e.V.","","","","","",""]
[33462,"H","Nico Sebastian","Föllmer","BGC Bremen","Ja","","","","",""]
[38474,"Jm","Robin","Forsberg","BGV Backumer Tal Herten e.V.","","","","","",""]
[38365,"H","Benjamin","Förster","KGC Bad Urach e.V.","","","","","",""]
[38366,"Sm 2","Rainer","Förster","KGC Bad Urach e.V.","","","","","",""]
[6770,"Sm 2","Jürgen","Förstner","Hamburger MC von 1965 e.V.","","","","","",""]
[44134,"Sm 1","Manfred","Foy","BGSV Castrop e.V. 1961","","","","","",""]
[43512,"Sm 1","Volker","Frahm","MGC Bad Oldesloe e.V.","","","","","",""]
[66698,"Schm","Fynn","Frank","Minigolfclub Karlshagen e.V.","","","","","",""]
[28168,"Sw 1","Petra","Frank","BSV 86 München e.V.","","","","","",""]
[21828,"Sm 2","Andreas","Frank","BSV 86 München e.V.","","","","","",""]
[38490,"Sm 2","Rolf","Frank","BGSV Bad Homburg","","","","","",""]
[29402,"D","Vanessa","Franke","1. BGC Rodalben 1977 e.V.","","","","","",""]
[43328,"Sm 1","Jörg","Franke","MGC Dormagen-Brechten e.V.","","","","","",""]
[66522,"Sw 2","Ulrich","Franke","MGC Brunsbüttel e.V.","","","","","",""]
[10722,"Sm 2","Helmut","Franz","1. MGC Süßen e.V.","","","","","",""]
[38052,"H","Maximilian","Frech","BSV Inzlingen 1979 e.V.","","","","","",""]
[65518,"Sm 1","Sven","Frech","BSV Inzlingen 1979 e.V.","","","","","",""]
[38037,"Sm 2","Bernd","Fregin","PTSV Hof, Abt. Minigolf ","","","","","",""]
[67366,"Sm 1","Christian","Freiberg","MGV Spandau","","","","","",""]
[67409,"Sm 2","Klaus Dieter","Freimann","MSF Brilon e.V.","","","","","",""]
[66905,"Sm 2","Rolf","Frenzel","SC Bad Münder","Ja","","","","",""]
[5387,"Sm 2","Heinz","Frenzl","1. NMC Kelheim e.V.","","","","","",""]
[37885,"H","Denis","Frerix","1. Essener CGC \"Blau-Gold\" e.V.","","","","","",""]
[37980,"D","Rebecca","Freßmann","MGC Kassel","Ja","","","","",""]
[66261,"H","Maurice","Freund","SG Arheilgen Abt. Bahnengolf","","","","","",""]
[66629,"Sm 2","Wilfried","Freund","SG Arheilgen Abt. Bahnengolf","","","","","",""]
[9289,"Sm 2","Ernst","Frick","MSC Bensheim-Auerbach e.V.","","","","","",""]
[33916,"H","René","Fricke","BGC Heilbronn e.V.","","","","","",""]
[30004,"Sm 1","Jörg","Fricker","SSC Attendorn e.V.","","","","","",""]
[66911,"Sm 1","Thomas","Friedmann","SG  Weiterstadt 1886 e.V.","","","","","",""]
[66912,"Sw 1","Heike","Friedmann","SG  Weiterstadt 1886 e.V.","","","","","",""]
[30258,"Sm 1","Holger","Friedrich","SV Lurup Abt. Bahnengolf","","","","","",""]
[37247,"Sm 1","Klaus","Friedrich","Biskirchener BGV e.V.","","","","","",""]
[23796,"Sm 2","Hans-Joachim","Friedrich","MGC Freizeitzentrum Biebertal","","","","","",""]
[62733,"Sm 2","Rolf","Friedrichs","BGC Hannover","Ja","","","","",""]
[31842,"Sm 1","Gerald","Friesacher","1. BGC Landshut e.V.","","","","","",""]
[65964,"Sw 1","Barbara","Friese","BGC Uerdingen e.V.","","","","","",""]
[65962,"Sm 2","Reinhard","Friese","BGC Uerdingen e.V.","","","","","",""]
[67216,"H","Oliver","Frings","MGC Bad Bodendorf e.V.","","","","","",""]
[66642,"Jm","Martin","Fritsch","MSC Bensheim-Auerbach e.V.","","","","","",""]
[27550,"Sm 1","Hans-Peter","Fritsch","MSC Bensheim-Auerbach e.V.","","","","","",""]
[38328,"H","Christian","Fritz","MGC Ostheim / Rhön e.V.","","","","","",""]
[34299,"H","Christian","Fritz","MC Möve Cuxhaven","Ja","","","","",""]
[66096,"H","Alexander","Fritz","MGC Kassel","Ja","","","","",""]
[49258,"D","Manuela","Fritz","MC Möve Cuxhaven","Ja","","","","",""]
[40034,"H","Thies","Fritzenkötter","BGSV Castrop e.V. 1961","","","","","",""]
[37088,"Sm 2","Dietmar","Fritzenkötter","BGSV Castrop e.V. 1961","","","","","",""]
[37089,"Sw 2","Margot","Fritzenkötter","BGSV Castrop e.V. 1961","","","","","",""]
[24461,"Sm 2","Joachim","Fröhner","MGC Rot-Weiß Wanne-Eickel e.V.","","","","","",""]
[48981,"H","Sascha","Frontzek","MGC Marl 1960 e.V.","","","","","",""]
[46404,"H","Andreas","Fuchs","BGC Neutraubling e.V.","","","","","",""]
[49798,"H","Christian","Fuchs","1. NMC Kelheim e.V.","","","","","",""]
[38576,"Jm","Tobias","Fuchs","MSK Neheim-Hüsten e.V.","","","","","",""]
[31272,"Sm 1","Thomas","Fuchs","MC Tigers Künsebeck","","","","","",""]
[42170,"Sw 1","Tanja","Fuchs","MC Tigers Künsebeck","","","","","",""]
[5081,"Sw 2","Angela","Fuchs","BGC Neutraubling e.V.","","","","","",""]
[30940,"H","Manuel","Fugazza","MC Ilvesheim e.V.","","","","","",""]
[66175,"Jm","Nico","Fuhrmann","MGC Kassel","Ja","","","","",""]
[66466,"Sm 1","Bernd","Fuhrmann","BGSC Bochum 1978 e.V.","","","","","",""]
[27212,"H","Stefan","Funk","MGC Oberkochen e.V.","","","","","",""]
[35791,"Sm 1","Andreas","Fütterer","Minigolf Wölfe Rheinstetten 02","","","","","",""]
[35793,"Sm 1","Thomas","Fütterer","Minigolf Wölfe Rheinstetten 02","","","","","",""]
[66611,"Jm","Simon","Gabriel","MSK Olching e.V.","","","","","",""]
[66461,"H","Andreas","Gade","BGC Celle","Ja","","","","",""]
[47236,"Sm 1","Dieter","Gallas","MGC Wertheim 91 e.V.","","","","","",""]
[66095,"H","Rafael","Gallego Lange","BGC Hannover","Ja","","","","",""]
[27566,"Sm 1","Jens","Galleinus","MSC Herscheid 1963 e.V.","","","","","",""]
[40205,"Sw 1","Ellen","Galleinus","MSC Herscheid 1963 e.V.","","","","","",""]
[66586,"Sm 1","Karl","Gallus","1. Bahnengolf-Club Singen e.V.","","","","","",""]
[66073,"Sm 2","Jürgen","Galz","BGSV Bad Homburg","","","","","",""]
[67370,"D","Viola","Gammert","Tempelhofer MV Berlin e.V.","","","","","",""]
[67091,"Sw 1","Gaby","Gäng","MGF Waldshut 74 e.V.","","","","","",""]
[66554,"Jm","Dennis","Garbe","MSG Kempten e.V.","","","","","",""]
[66553,"Sm 1","Michael","Garbe","MSG Kempten e.V.","","","","","",""]
[45293,"Sm 1","Bruno","Garbers","SC Olympia Dortmund e.V.","","","","","",""]
[37874,"Sm 2","Joachim","Garden","MGC Rot-Weiß Wanne-Eickel e.V.","","","","","",""]
[38071,"Sm 2","Alfred","Gareis","1. MGSV Netphen e.V.","","","","","",""]
[38168,"H","Chris","Garte","MV Lankwitzer Dragons","","","","","",""]
[34722,"Sm 2","Wolfgang","Gasch","MGV Eibenstock","","","","","",""]
[65897,"D","Birgit","Gase","1. MGC Gelsenkirchen e.V.","","","","","",""]
[38592,"Sm 1","Timo","Gase","1. MGC Gelsenkirchen e.V.","","","","","",""]
[34092,"Sm 1","Wolfgang","Gaute","VfL Lüneburg","Ja","","","","",""]
[3375,"Sm 2","Sylvester","Gawlowski","MGC Marl 1960 e.V.","","","","","",""]
[3430,"Sw 2","Anna","Gawlowski","MGC Marl 1960 e.V.","","","","","",""]
[67293,"H","Helge","Gebauer","SSC Attendorn e.V.","","","","","",""]
[67294,"Jm","Leon","Gebauer","SSC Attendorn e.V.","","","","","",""]
[42043,"Sm 2","Kurt","Gebauer","1. MGC München-Feldmoching e.V.","","","","","",""]
[66561,"Jw","Emily","Gebhardt","MSV Berliner Bär e.V.","","","","","",""]
[66562,"Sm 1","Andreas","Gebhardt","MSV Berliner Bär e.V.","","","","","",""]
[66563,"Sw 1","Kirstin","Gebhardt","MSV Berliner Bär e.V.","","","","","",""]
[66707,"Jw","Sarah","Gefreyer","BGC Bremen","Ja","28970","X","","",""]
[67012,"Sm 1","Steffen","Gefreyer","BGC Bremen","Ja","29405","X","","","X"]
[65466,"D","Alina","Gehrke","TSV Salzgitter","Ja","26090","X","","",""]
[1963,"Sm 1","Jörg","Gehrke","TSV Salzgitter","Ja","3527","","X","",""]
[65468,"Sw 1","Cornelia","Gehrke","TSV Salzgitter","Ja","","","","",""]
[16436,"Sm 1","Jürgen","Geiger","1. Bahnengolf-Club Singen e.V.","","","","","",""]
[43120,"Sm 1","Thorsten","Geiger","BGC Heilbronn e.V.","","","","","",""]
[67305,"Jm","Gabriel","Geishüttner","MGC Nümbrecht e.V.","","","","","",""]
[67306,"Sm 1","Gerhard","Geishüttner","MGC Nümbrecht e.V.","","","","","",""]
[42662,"Sm 1","Ralf","Geissler","1. MGC Metzingen e.V.","","","","","",""]
[43605,"H","Alexander","Geist","BGS Hardenberg-Pötter e.V.","","","","","",""]
[24314,"Sw 1","Michaela","Geist","MSC Bensheim-Auerbach e.V.","","","","","",""]
[41874,"Sm 1","Rainer","Gellermann","SGC Hagen e.V.","","","","","",""]
[65931,"Sm 1","Michael","Genzer","BGC Dormagen e.V.","","","","","",""]
[34839,"Sm 1","Holger","Georgi","Reinickendorfer MGC e.V.","","","","","",""]
[35794,"H","Martin","Gerbert","Minigolf Wölfe Rheinstetten 02","","","","","",""]
[32966,"Sm 1","Alfred","Gerdeisen","1. BGC Garmisch-Partenkirchen","","","","","",""]
[34891,"H","Felix","Gerhardt","MGC Murnau am Staffelsee e.V.","","","","","",""]
[35437,"H","Markus","Gerlach","MC Tigers Künsebeck","","","","","",""]
[37960,"H","Marco","Gerlach","BGC Uerdingen e.V.","","","","","",""]
[35436,"Sm 1","Stefan","Gerlach","MGC Bad Salzuflen e.V.","","","","","",""]
[62148,"Sm 2","Karl","Gerling","BGC Hamm 1959 e.V.","","","","","",""]
[5821,"Sm 2","Karl-Heinz","Gerwert","MGF Waldshut 74 e.V.","","","","","",""]
[37060,"H","Yannis","Geschonke","MSV Bad Münder/Springe","Ja","","","","",""]
[37063,"Sm 2","Manfred","Geschonke","MSV Bad Münder/Springe","Ja","","","","",""]
[35329,"H","Kevin","Gesell","MGC Bad Feilnbach e.V.","","","","","",""]
[25206,"Sm 1","Thomas","Giebenhain","MSC Bensheim-Auerbach e.V.","","","","","",""]
[50294,"Sm 2","Heinz-Theo","Giegel","BGV Backumer Tal Herten e.V.","","","","","",""]
[30460,"H","Pascal","Gillen","1. KC Homburg-Saar 1967 e.V.","","","","","",""]
[63304,"Sm 2","Klaus","Giller","SSV Ulm 1846 Abt. Bahnengolf","","","","","",""]
[66805,"Sm 2","Hans Peter","Gimmler","TSV 1848 Flöha","","","","","",""]
[33015,"H","Marco","Ginal","Miniaturgolf Sportclub Schriesheim e.V","","","","","",""]
[66864,"Sm 2","Rudolf","Ginschel","Bochumer Minigolf-Club 1960 e.V.","","","","","",""]
[33433,"H","Dimitri","Gkotses","MGF Hammer e.V.","","","","","",""]
[36872,"H","Timo","Glaser","Miniaturgolf Sportclub Schriesheim e.V","","","","","",""]
[38284,"H","Nils","Glaser","Miniaturgolf Sportclub Schriesheim e.V","","","","","",""]
[55133,"Sm 1","Michael","Glaser","MGC Bad Soden-Salmünster","","","","","",""]
[31211,"Sw 1","Ute","Glaser","1. CGC Blau-Gelb Grötzingen","","","","","",""]
[22832,"Sm 2","Helmut","Glaser","MGC Sulzfeld e.V.","","","","","",""]
[67143,"H","Florian","Gläser","MGC Lohfelden","Ja","","","","",""]
[66799,"H","Felix","Glück","1. MGC Mainz e.V.","","","","","",""]
[33705,"H","Jan","Göbel","MGC Wertheim 91 e.V.","","","","","",""]
[67146,"Sm 2","Günter","Göbel","MGC Felderbachtal 1964 e.V.","","","","","",""]
[67145,"Sw 2","Marina","Göbel","MGC Felderbachtal 1964 e.V.","","","","","",""]
[41340,"Sm 2","Michael","Gohl","MC Georgsmarienhütte e.V.","","","","","",""]
[19022,"Sm 2","Andreas","Goihl","MCE Sindelfingen e.V.","","","","","",""]
[4276,"Sm 2","Heinz","Goitowski","MGC Lippe-Detmold e.V.","","","","","",""]
[66753,"Sw 1","Silke","Gold","MGF Magdeburg 1995 e.V.","","","","","",""]
[67218,"H","Thorsten","Goldau","1. MGC Gelsenkirchen e.V.","","","","","",""]
[67233,"Sm 2","Holger","Goldenbow","MSV Bad Münder/Springe","Ja","","","","",""]
[34013,"Sm 1","Heiko","Golder","Reinickendorfer MGC e.V.","","","","","",""]
[36159,"Sm 2","Helmut","Goldschmidt","MSV Bad Kreuznach","","","","","",""]
[66631,"Sm 2","Heribert","Golka","BGC Hannover","Ja","","","","",""]
[66872,"Sm 1","Gerhard","Goller","1. FMGC Lichtenfels 1961 e.V.","","","","","",""]
[66980,"D","Nicole","Gombert","MSK Olching e.V.","","","","","",""]
[66763,"Schm","Michael","Goresch","1. BGC Landshut e.V.","","","","","",""]
[17705,"Sm 2","Erwin","Görgen","MGC Traben-Trarbach","","","","","",""]
[31965,"H","Dennis","Gorges","1. KC Homburg-Saar 1967 e.V.","","","","","",""]
[67035,"D","Petra","Görtz","1. MGC Mainz e.V.","","","","","",""]
[50035,"H","Andreas","Görtz-Fräßle","1. MGC Mainz e.V.","","","","","",""]
[65830,"D","Yvonne","Gose","MGV Spandau","","","","","",""]
[36076,"Sw 2","Ellen","Gose","MGV Spandau","","","","","",""]
[37377,"D","Sabrina","Gothmann","1. MGC Tuttlingen e.V.","","","","","",""]
[66133,"Sm 2","Bernd","Götter","BGC Hannover","Ja","","","","",""]
[66134,"Sw 2","Helga","Götter","BGC Hannover","Ja","","","","",""]
[66227,"Sm 2","Wolfgang","Gotthard","1. BGC Garmisch-Partenkirchen","","","","","",""]
[66476,"D","Runa Sophia","Gottke","MGC Traben-Trarbach","","","","","",""]
[38630,"H","Hendrik","Göttmann","SG Arheilgen Abt. Bahnengolf","","","","","",""]
[38631,"Sm 2","Holger","Göttmann","SG Arheilgen Abt. Bahnengolf","","","","","",""]
[67015,"Sm 2","Wolfgang","Gottschling","1. CGC Blau-Gelb Grötzingen","","","","","",""]
[67156,"Jm","Nils","Gottwald","SV Gebhardshagen","Ja","","","","",""]
[34709,"Sm 1","Holger","Götz","BGC Neutraubling e.V.","","","","","",""]
[40135,"Sm 1","Christian","Graage","Preetzer TSV von 1861 e.V. Abt. Minigolf","","","","","",""]
[37979,"Sm 2","Thomas","Gräber","1. MC Weinheim e.V.","","","","","",""]
[66812,"Sm 1","Wolfgang","Gräble","MGF Hilzingen 80 e.V.","","","","","",""]
[25675,"H","Markus","Grabrucker","OMGC Ingolstadt e.V.","","","","","",""]
[40381,"H","Stefan","Grabrucker","OMGC Ingolstadt e.V.","","","","","",""]
[30979,"D","Stephanie","Grabrucker","OMGC Ingolstadt e.V.","","","","","",""]
[67139,"Schw","Lena","Grabrucker","OMGC Ingolstadt e.V.","","","","","",""]
[28389,"Sm 1","Manfred","Grabrucker","OMGC Ingolstadt e.V.","","","","","",""]
[5271,"Sm 2","Anton","Grabrucker","OMGC Ingolstadt e.V.","","","","","",""]
[9033,"Sw 2","Elfriede","Grabrucker","OMGC Ingolstadt e.V.","","","","","",""]
[37359,"H","Lars","Graeber","BGV Bergisch Land 1962 / 63 e.V.","","","","","",""]
[33132,"Sm 2","Roger","Graf","MGC Traben-Trarbach","","","","","",""]
[66498,"Sm 1","Thomas","Gräf","MGF Ottobrunn e.V.","","","","","",""]
[34316,"H","Ingo","Graf von Mainberg","BGC Schweinfurt e.V.","","","","","",""]
[34359,"Sm 2","Frank","Gramer","1. MGC Tuttlingen e.V.","","","","","",""]
[18068,"Sm 2","Gerhard","Grande","MGSC Wernau e.V.","","","","","",""]
[1344,"Sw 1","Susanne","Granz","MC Möve Cuxhaven","Ja","2909","","","","X"]
[45502,"Sm 1","Gerno","Grapengeter","MGC Dormagen-Brechten e.V.","","","","","",""]
[66277,"Jw","Patricia","Gras","MGC Millennium Lorsch e.V.","","","","","",""]
[67320,"Sm 1","André","Gras","MGC Peine","Ja","","","","",""]
[66658,"Jm","Lucas","Graumann","TSV Salzgitter","Ja","","","","",""]
[66648,"H","Eicke","Greh","Reinickendorfer MGC e.V.","","","","","",""]
[47443,"H","Timo","Greiffendorf","BGC Leipzig","","","","","",""]
[30056,"H","Lars","Greiffendorf","1. MGC Mainz e.V.","","","","","",""]
[3800,"Sm 2","Hellmut","Greiffendorf","MGC \"AS\" Witten 1963 e.V.","","","","","",""]
[22846,"Sm 2","Dieter","Gremm","BGC Uerdingen e.V.","","","","","",""]
[31762,"Sm 1","Thomas","Gress","MGC Bad Hersfeld","","","","","",""]
[67095,"Schm","Simon","Griebat","MSK Olching e.V.","","","","","",""]
[48552,"Sm 2","Dieter","Griegel","VfM e.V. Berlin ","","","","","",""]
[46148,"Sm 1","Ottmar","Gries","SSV Ulm 1846 Abt. Bahnengolf","","","","","",""]
[67065,"Sw 1","Christine","Gries","SSV Ulm 1846 Abt. Bahnengolf","","","","","",""]
[25960,"Sm 1","Bernd","Grigo","VfM Bottrop e.V.","","","","","",""]
[37669,"H","Marcus","Grimm","BSV 86 München e.V.","","","","","",""]
[65794,"Sm 2","Wolf-Dieter","Grimm","SV Lurup Abt. Bahnengolf","","","","","",""]
[463,"Sm 1","Uwe","Grimme","1. NMC Kelheim e.V.","","","","","",""]
[66339,"Sm 1","Thomas ","Grobe","BGC Hannover","Ja","28375","X","","","X"]
[38540,"Sm 1","Robert","Grobe","MGC Rot-Weiß Wanne-Eickel e.V.","","","","","",""]
[67029,"Sm 1","Bernhard","Gröbel","MSV Würzburg-Löwenbrücke e.V.","","","","","",""]
[66416,"Sm 2","Ronald","Groenewoud","BGSV Castrop e.V. 1961","","","","","",""]
[36717,"Sm 2","Rainer","Grohse","MGC Brunsbüttel e.V.","","","","","",""]
[65954,"H","Frederick","Grombein","Kölner Miniatur Golf Club e.V.","","","","","",""]
[66567,"Sm 2","Frank","Gromm","BGSC \"Gut Schlag\" Gladbeck e.V.","","","","","",""]
[26423,"H","Markus","Groneberg","VfM e.V. Berlin ","","","","","",""]
[65976,"Sm 2","Thomas","Gronski","MGC Bergisch Gladbach Gierath e.V.","","","","","",""]
[65971,"Sw 2","Friederike","Gronski","MGC Bergisch Gladbach Gierath e.V.","","","","","",""]
[22243,"Sw 2","Ina","Grosse","TV Trappenkamp e.V. - Minigolf -","","","","","",""]
[38461,"H","Lennart","Großmann","BGC Wolfsburg","Ja","","","","",""]
[30400,"Sm 1","Bertold","Großmann","MGC Sulzfeld e.V.","","","","","",""]
[37516,"Sw 1","Rosemarie","Groteböhmer","MSC Bad Godesberg e.V.","","","","","",""]
[29588,"H","Stefan","Gruber","MGC Murnau am Staffelsee e.V.","","","","","",""]
[31872,"H","Christoph","Grübl","1. BGC Landshut e.V.","","","","","",""]
[6550,"Sw 2","Sieglinde","Grübl","1. BGC Landshut e.V.","","","","","",""]
[3802,"Sm 2","Jürgen","Grügelsberg","MGC \"AS\" Witten 1963 e.V.","","","","","",""]
[3126,"Sw 2","Marianne","Grügelsberg","MGC \"AS\" Witten 1963 e.V.","","","","","",""]
[25695,"Sw 1","Iris","Grün","BGC Dormagen e.V.","","","","","",""]
[67264,"Sm 2","Richard","Grünberg","TSV Kücknitz Abt. Bahnengolf","","","","","",""]
[35168,"Sm 1","Dirk","Gründer","BGSC \"Gut Schlag\" Gladbeck e.V.","","","","","",""]
[66884,"H","Benedikt","Grundmüller","MGC Ingolstadt e.V.","","","","","",""]
[66883,"Jm","Thomas","Grundmüller","MGC Ingolstadt e.V.","","","","","",""]
[44875,"Sm 1","Franz","Grundmüller","MGC Ingolstadt e.V.","","","","","",""]
[44874,"Sw 1","Sonja","Grundmüller","MGC Ingolstadt e.V.","","","","","",""]
[4233,"Sm 2","Adolf","Grüne","SV Gebhardshagen","Ja","","","","",""]
[50093,"Sm 1","Frank","Grunert","TSV Salzgitter","Ja","","","","",""]
[46269,"Sm 2","Uwe","Grüning","BGC Hannover","Ja","19699","","X","",""]
[44280,"Sw 2","Eveline","Grüning","BGC Hannover","Ja","","","","",""]
[65943,"D","Luisa-Marie","Grüninger","MGC Murnau am Staffelsee e.V.","","","","","",""]
[45426,"H","Christoph","Grunt","1. MGC Ludwigshafen e.V.","","","","","",""]
[38264,"Sm 2","Roland","Gruschka","MGC Schwaikheim e.V.","","","","","",""]
[35795,"Sw 1","Beatriz","Grüßinger","Minigolf Wölfe Rheinstetten 02","","","","","",""]
[46450,"Sm 2","Ulrich","Grützner","MC Möve Cuxhaven","Ja","","","","",""]
[31639,"Sm 1","Andreas","Grzeski","BGSV Kerpen e.V.","","","","","",""]
[22467,"Sm 2","Joachim","Grzyb-Bonsack","MSK Neheim-Hüsten e.V.","","","","","",""]
[38611,"H","Julian","Guddat","BGV Bergisch Land 1962 / 63 e.V.","","","","","",""]
[35156,"H","Matthias","Guhe","1.KGC Mönchengladbach e.V.","","","","","",""]
[27486,"H","Thomas","Gulz","MGC 85 Bönnigheim","","","","","",""]
[33357,"Sm 2","Jürgen","Gundermann","MGC Dortmund Syburg e.V.","","","","","",""]
[50029,"D","Nicole","Gundert","1. MGC Mainz e.V.","","","","","",""]
[67400,"Sm 1","Thomas","Guney","MC Georgsmarienhütte e.V.","","","","","",""]
[48275,"H","Rudolf","Guni","MGC Murnau am Staffelsee e.V.","","","","","",""]
[67195,"H","Jesse","Günther","MGC Kassel","Ja","","","","",""]
[66718,"Jm","Kevin","Günther","Hamburger MC von 1965 e.V.","","","","","",""]
[6740,"Sm 2","Klaus","Gust","MGC Felderbachtal 1964 e.V.","","","","","",""]
[31177,"Sm 1","Oliver","Gut","MGF Waldshut 74 e.V.","","","","","",""]
[66202,"H","Sebastian","Guth","1. KC Homburg-Saar 1967 e.V.","","","","","",""]
[32535,"H","Benjamin","Güth","Niendorfer MC","","","","","",""]
[43241,"Sm 1","Udo","Guttroff","1. MGC Metzingen e.V.","","","","","",""]
[41298,"Sm 2","Dieter","Haag","BGC Heilbronn e.V.","","","","","",""]
[38354,"D","Alexandra","Haas","BSV 82 Ohlsbach e.V.","","","","","",""]
[40878,"Sm 2","Wolfgang","Haas","1. BGC Bad Füssing e.V.","","","","","",""]
[67101,"Schm","Ben","Haase","SV Lurup Abt. Bahnengolf","","","","","",""]
[41960,"Sm 1","Guido","Haase","MGC Kassel","Ja","","","","",""]
[67344,"Sw 2","Erika","Haase","MGC Kassel","Ja","","","","",""]
[66539,"D","Felicitas","Haberl","MGC Ingolstadt e.V.","","","","","",""]
[66838,"Jw","Lena","Haberl","MGC Ingolstadt e.V.","","","","","",""]
[29277,"Sm 1","Volker","Haberl","MGC Ingolstadt e.V.","","","","","",""]
[27189,"Sm 2","Klaus","Hablitzel","1. MGC Tuttlingen e.V.","","","","","",""]
[27909,"Sm 2","Klaus","Habrich","1. MGC Süßen e.V.","","","","","",""]
[34559,"H","Danny","Hackel","MGC Homburger Land e.V.","","","","","",""]
[37074,"Sm 2","Günter","Hackenberg","MGC Kassel","Ja","15082","","","",""]
[37079,"Sm 2","Willi","Hackenberg","MGC Kassel","Ja","15087","","","","X"]
[33744,"H","Sascha","Hackfurt","BGC Uerdingen e.V.","","","","","",""]
[24871,"H","Christian","Haeger","Bochumer Minigolf-Club 1960 e.V.","","","","","",""]
[34296,"Sm 1","Robert","Hägele","MGC Bad Feilnbach e.V.","","","","","",""]
[42010,"Sm 2","Bernd","Hägele","BG Pfullingen","","","","","",""]
[66990,"Jm","David","Hagemeyer","BGSV Bad Homburg","","","","","",""]
[17834,"Sm 2","Leo","Hagenlüke","BV Sennestadt","","","","","",""]
[46374,"H","Timon","Hahn","VfB Osnabrück e.V.","","","","","",""]
[48646,"D","Corinna","Hahn","1. MGC Ludwigshafen e.V.","","","","","",""]
[44416,"Sm 1","Robert","Hahn","1. MGC Ludwigshafen e.V.","","","","","",""]
[65301,"Sm 2","Rolf","Haid","1. MGC Hechingen","","","","","",""]
[65300,"Sw 2","Kornelia","Haid","1. MGC Hechingen","","","","","",""]
[20299,"Sm 2","Ottmar","Haidl","MCE Sindelfingen e.V.","","","","","",""]
[62626,"Sw 2","Christa","Hainz","BGS Hardenberg-Pötter e.V.","","","","","",""]
[66432,"Sm 1","Thomas","Hainzl","MGF Ottobrunn e.V.","","","","","",""]
[42187,"Sm 2","Siegfried","Hake","BGC Goslar","Ja","17323","","X","",""]
[66115,"H","Alexander","Halbauer","MSG Kempten e.V.","","","","","",""]
[42555,"Sm 1","Markus","Haller","1. NMC Kelheim e.V.","","","","","",""]
[65847,"H","Markus","Hallhuber","BSV Inzlingen 1979 e.V.","","","","","",""]
[47240,"Sm 1","Martin","Halscheidt","MGC Wertheim 91 e.V.","","","","","",""]
[45662,"Sm 1","Matthias","Halstein","BGC Bremen","Ja","","","","",""]
[35765,"Sw 1","Marina","Hammann","MC Ilvesheim e.V.","","","","","",""]
[36423,"D","Melanie","Hammerschmidt","MGC Oberkochen e.V.","","","","","",""]
[26302,"Sw 1","Sabine","Hammerschmidt","MGF Hilzingen 80 e.V.","","","","","",""]
[42281,"Sm 1","Michael","Hammon","BGC Bad Berneck e.V.","","","","","",""]
[43760,"Sw 1","Dagmar","Hammon","BGC Bad Berneck e.V.","","","","","",""]
[36282,"H","Dennis","Handtke","MSK Neheim-Hüsten e.V.","","","","","",""]
[38511,"D","Sarah","Handtke","MSK Neheim-Hüsten e.V.","","","","","",""]
[67148,"Jm","Jonas","Handtke","MSK Neheim-Hüsten e.V.","","","","","",""]
[40161,"Sm 2","Michael","Handtke","MSK Neheim-Hüsten e.V.","","","","","",""]
[63732,"Sm 1","Dieter","Hanisch","MGC Ingolstadt e.V.","","","","","",""]
[66982,"Schm","Maximilian","Hanke","MGF Ottobrunn e.V.","","","","","",""]
[66983,"Sm 1","Werner","Hanke","MGF Ottobrunn e.V.","","","","","",""]
[49941,"H","Sven","Hänke","MC Flora Elmshorn e.V.","","","","","",""]
[26439,"Sm 2","Rainer","Hanker","BGSC \"Gut Schlag\" Gladbeck e.V.","","","","","",""]
[45588,"Sm 2","Johann","Hann","SSV Ulm 1846 Abt. Bahnengolf","","","","","",""]
[61071,"Sm 2","Anton","Hannausek","MGC Rot-Weiß Wanne-Eickel e.V.","","","","","",""]
[64724,"H","Andreas","Hannemann-Schmidhuber","1. BGC Landshut e.V.","","","","","",""]
[64722,"Sw 1","Claudia","Hannemann-Schmidhuber","1. BGC Landshut e.V.","","","","","",""]
[43553,"Sm 1","Jörg","Hannmann","Niendorfer MC","","","","","",""]
[45795,"Sm 2","Jürgen","Hansel","CGC Illertal Kellmünz","","","","","",""]
[32383,"H","Mike","Hansen","MSC Bad Godesberg e.V.","","","","","",""]
[38016,"H","Pascal","Hansen","BGS Hardenberg-Pötter e.V.","","","","","",""]
[28083,"D","Nicole","Hansen","MGC Bad Bodendorf e.V.","","","","","",""]
[67093,"Schm","Marc","Hansen","MGC Bad Bodendorf e.V.","","","","","",""]
[11,"Sm 1","Svend","Hansen","MGC Harrislee-Wassersleben","","","","","",""]
[52109,"Sw 2","Sabine","Hansen","BGC Kiel West e.V.","","","","","",""]
[47253,"Sw 1","Angelika","Hansmeier","MGC Bad Salzuflen e.V.","","","","","",""]
[38421,"Sm 1","Thomas","Hansper","MGV Spandau","","","","","",""]
[66157,"Sw 1","Heike","Hansper","MGV Spandau","","","","","",""]
[66853,"H","Martin","Hänßgen","MGF Magdeburg 1995 e.V.","","","","","",""]
[22800,"H","Jochen","Hänßler","1. MGC Tuttlingen e.V.","","","","","",""]
[37141,"H","Andreas","Hardt","MV Lankwitzer Dragons","","","","","",""]
[45059,"D","Claudia","Hardt","MV Lankwitzer Dragons","","","","","",""]
[67418,"D","Janina","Hardt","BGSV Aßlar 1987 e.V.","","","","","",""]
[50257,"Sw 1","Ute","Häring","SSV Ulm 1846 Abt. Bahnengolf","","","","","",""]
[25381,"Sm 2","Armin","Härle","MGSC Wernau e.V.","","","","","",""]
[36571,"H","Mark","Harmening","1. MGC Mainz e.V.","","","","","",""]
[19114,"Sm 2","Herbert","Harms","MGC Millennium Lorsch e.V.","","","","","",""]
[33191,"H","Stefan","Härtel","VfB Osnabrück e.V.","","","","","",""]
[23282,"Sm 2","Paul","Hartenbach","2. MGC Worms","","","","","",""]
[4021,"Sm 2","Gustav","Hartfuhs","BGC Illertissen e.V.","","","","","",""]
[67121,"D","Tamara","Hartkorn","1. CGC Blau-Gelb Grötzingen","","","","","",""]
[67013,"Schm","Max","Hartkorn","1. CGC Blau-Gelb Grötzingen","","","","","",""]
[67120,"Sm 1","Mario","Hartkorn-Götz","1. CGC Blau-Gelb Grötzingen","","","","","",""]
[49269,"Sm 2","Matthias","Hartl","MSC Bad Godesberg e.V.","","","","","",""]
[3874,"Sm 2","Wolfgang","Härtl","PTSV Hof, Abt. Minigolf ","","","","","",""]
[44936,"Sm 2","Ingo","Hartlein","BGC Bad Nenndorf","Ja","18849","X","","",""]
[49,"Sm 1","Rolf","Hartmaier","BIG ASPERG e.V.","","","","","",""]
[33896,"Sm 2","Jürgen","Hartmaier","BGC Heilbronn e.V.","","","","","",""]
[30051,"H","Jörg","Hartmann","Tempelhofer MV Berlin e.V.","","","","","",""]
[36667,"H","Maximilian","Hartmann","BGC Illertissen e.V.","","","","","",""]
[63738,"H","Christian","Hartmann","MSG Kempten e.V.","","","","","",""]
[67106,"Jm","Leo","Hartmann","TSV Kücknitz Abt. Bahnengolf","","","","","",""]
[34233,"Sw 1","Kerstin","Hartmann","BGC Hannover","Ja","12337","","X","","X"]
[5033,"Sm 2","Peter","Hartmann","1. CGC Blau-Gelb Grötzingen","","","","","",""]
[26119,"Sm 2","Rochus","Hartmann","BGC Bad Nenndorf","Ja","7758","","X","",""]
[41738,"Sm 2","Friedrich","Haschberger","1. BGC Landshut e.V.","","","","","",""]
[38534,"Jm","Felix","Hasenberg","SGC Hagen e.V.","","","","","",""]
[29346,"Sm 1","Christoph","Hasenberg","SGC Hagen e.V.","","","","","",""]
[43147,"Sw 1","Heike","Hasenberg","SGC Hagen e.V.","","","","","",""]
[37054,"Sm 2","Dirk","Hasenclever","BGC Leipzig","","","","","",""]
[35711,"Sm 2","Johann","Hasenfuss","SC Bad Münder","Ja","","","","",""]
[66796,"H","Christian","Haß","BGC Bildstock e.V.","","","","","",""]
[43779,"Sm 1","Lars","Hasse","MGC Göttingen","Ja","18182","","X","",""]
[34250,"Sm 2","Rainer","Hasse","Preetzer TSV von 1861 e.V. Abt. Minigolf","","","","","",""]
[34249,"Sw 2","Monika","Hasse","Preetzer TSV von 1861 e.V. Abt. Minigolf","","","","","",""]
[5263,"Sm 2","Kurt","Hasselwander","MSV Bad Kreuznach","","","","","",""]
[41949,"Sw 2","Agni","Hau","1. Essener CGC \"Blau-Gold\" e.V.","","","","","",""]
[47485,"Sm 2","Reinhard","Haubeil","1. BGC Wesseling 1975 e.V.","","","","","",""]
[10992,"Sm 2","Franz","Haubner","1. NMC Kelheim e.V.","","","","","",""]
[1541,"Sm 2","Uwe","Haubold","MGV Bremen","Ja","","","","",""]
[35810,"H","Timm","Haucke","SC Bastion Rot Weiß Lippstadt e.V.","","","","","",""]
[4204,"Sm 2","Karlheinz","Haucke","SC Bastion Rot Weiß Lippstadt e.V.","","","","","",""]
[31350,"H","Jörg","Hauer","BGC Heilbronn e.V.","","","","","",""]
[37399,"D","Maike","Haupt","MGC Dormagen-Brechten e.V.","","","","","",""]
[66998,"Schm","Lukas","Haupt","MGF Magdeburg 1995 e.V.","","","","","",""]
[37692,"Sm 1","Michael","Haupter","1. MGC Metzingen e.V.","","","","","",""]
[34570,"Sw 2","Karin","Hauschke","1. Minigolf-Club Rheinhausen e.V.","","","","","",""]
[67383,"Sm 2","Alois","Hauser","BSV 82 Ohlsbach e.V.","","","","","",""]
[35083,"Sm 2","Hans","Häuserer","1. BGC Garmisch-Partenkirchen","","","","","",""]
[37363,"H","Julian","Häusler","1. MSC Wesel 6.6.1966 e.V.","","","","","",""]
[65456,"Sm 1","Gerd ","Hausmann","1. MGC Ludwigshafen e.V.","","","","","",""]
[35145,"Sm 2","Erich","Hauth","MGC Traben-Trarbach","","","","","",""]
[37511,"H","Christian","Hebbeln","Hamburger MC von 1965 e.V.","","","","","",""]
[37853,"D","Carina","Hebbeln","Hamburger MC von 1965 e.V.","","","","","",""]
[67126,"Sm 2","Bernd","Heber","SV 1890 e.V. Dreieichenhain, Abt. Bahnengolf","","","","","",""]
[32382,"H","Stefan","Hecken","MC Tigers Künsebeck","","","","","",""]
[20081,"Sm 2","Michael","Hecken","MC Neuwied","","","","","",""]
[66901,"Schm","Sebastian","Heckmann","1. MGC Ladenburg e.V.","","","","","",""]
[36956,"H","Tobias","Heer","MGC Bad Homburg vdH e.V.","","","","","",""]
[36425,"Sm 2","Ludwig","Heer","MGC Bad Homburg vdH e.V.","","","","","",""]
[30816,"Sw 1","Laila","Heerich","MGC Kassel","Ja","10073","","X","",""]
[21948,"Sm 2","Ralph","Heerich","MGC Kassel","Ja","6606","","X","","X"]
[51888,"Sm 2","Hans-Joachim","Heese","MGC Freizeitzentrum Biebertal","","","","","",""]
[26259,"Sm 2","Karl-Heinz","Hefner","MGC Ostheim / Rhön e.V.","","","","","",""]
[36131,"H","Marcel","Heger","1. CGC Blau-Gelb Grötzingen","","","","","",""]
[65149,"Sm 1","Thomas","Heger","MGC Heringen 1997 e.V.","","","","","",""]
[46457,"Sm 1","Falk","Heidecke","MC Möve Cuxhaven","Ja","","","","",""]
[34093,"Sm 2","Adolf","Heidler","MC Möve Cuxhaven","Ja","","","","",""]
[28904,"Sw 2","Ursula","Heiliger","BGC Wolfsburg","Ja","","","","",""]
[18150,"Sm 2","Horst","Heilmann","BGSC Bochum 1978 e.V.","","","","","",""]
[23436,"H","Dirk","Hein","Tempelhofer MV Berlin e.V.","","","","","",""]
[27863,"Sm 1","Hans-Jörg","Hein","MGC \"AS\" Witten 1963 e.V.","","","","","",""]
[29808,"Sm 1","Karsten","Hein","BGV Bergisch Land 1962 / 63 e.V.","","","","","",""]
[24422,"Sw 2","Helga","Hein","1. NMC Kelheim e.V.","","","","","",""]
[40930,"H","Sebastian","Heine","MGC Dormagen-Brechten e.V.","","","","","",""]
[1723,"Sm 2","Peter","Heine","BGC Hannover","Ja","","","","",""]
[36223,"Sm 2","Lothar","Heine","1. MSC Wesel 6.6.1966 e.V.","","","","","",""]
[33352,"H","Andreas","Heinel","MSK Olching e.V.","","","","","",""]
[35309,"D","Marina","Heinel","1. FMGC Lichtenfels 1961 e.V.","","","","","",""]
[41617,"H","Marco","Heinisch","BGC Bad Nenndorf","Ja","17039","","X","",""]
[35094,"D","Stefanie","Heinisch","BGC Bad Nenndorf","Ja","","","","",""]
[66117,"Jm","Justin","Heinisch","BGC Bad Nenndorf","Ja","","","","",""]
[66118,"Schm","Vincent","Heinisch","BGC Bad Nenndorf","Ja","","","","",""]
[31397,"Sm 2","Hans-Werner","Heinisch","BGC Bad Nenndorf","Ja","10437","","X","",""]
[31244,"D","Sabrina","Heinrich","MGC Traben-Trarbach","","","","","",""]
[63138,"Sm 2","Helmut","Heinrich","MSV Bad Kreuznach","","","","","",""]
[5129,"Sm 2","Werner","Heinrich","1. MSC Wesel 6.6.1966 e.V.","","","","","",""]
[67325,"Sm 1","Michael","Heinrichs","BSC Ennepetal e.V.","","","","","",""]
[48909,"H","Tobias","Heintze","1. Minigolf-Club Rheinhausen e.V.","","","","","",""]
[65896,"Sm 2","Klaus","Heinz","1. MGC Gelsenkirchen e.V.","","","","","",""]
[30057,"D","Doris","Heinze","BSV AOK Leipzig e.V.","","","","","",""]
[42001,"Sm 1","Thomas","Heinzelmann","BG Pfullingen","","","","","",""]
[37194,"H","Ingmar","Heipel","SG Arheilgen Abt. Bahnengolf","","","","","",""]
[66926,"Sw 1","Daniela","Heise","BGC Northeim","Ja","","","","",""]
[50371,"Sw 1","Stefanie","Heise","MGC Bad Salzuflen e.V.","","","","","",""]
[44726,"H","Thomas","Heisel","BGC Diepholz","Ja","","","","",""]
[44731,"Sw 2","Regina","Heisel","BGC Diepholz","Ja","","","","",""]
[66918,"Schm","Phil Joel","Heiß","BSC Ennepetal e.V.","","","","","",""]
[36965,"Sm 1","Dieter","Heisterklaus","MSK Neheim-Hüsten e.V.","","","","","",""]
[67053,"Sm 2","Johann","Hejosch","BV Sennestadt","","","","","",""]
[66236,"Sw 2","Barbara","Helfmann","MGC Bergisch Gladbach Gierath e.V.","","","","","",""]
[66385,"Sm 2","Dieter","Helken","SV Gebhardshagen","Ja","","","","",""]
[49900,"H","Sven","Helldörfer","MGC Murnau am Staffelsee e.V.","","","","","",""]
[30650,"Sm 2","Oswald","Heller","MGC Murnau am Staffelsee e.V.","","","","","",""]
[34374,"Sm 2","Herbert","Heller","MGC Ostheim / Rhön e.V.","","","","","",""]
[5340,"Sm 2","Hans-Peter","Heller","BGSV Kerpen e.V.","","","","","",""]
[46285,"Sw 2","Gabriele","Heller","BGSV Kerpen e.V.","","","","","",""]
[37321,"H","Christian","Hellmann","MGC Rot-Weiß Wanne-Eickel e.V.","","","","","",""]
[27801,"Sm 1","Uwe","Hellmich","VfM Bottrop e.V.","","","","","",""]
[46744,"Sw 1","Elvira","Hellmich","VfM Bottrop e.V.","","","","","",""]
[32968,"Sm 1","Martin","Hellwig","KSV Baltrum e.V.","","","","","",""]
[44381,"Sm 1","Markus","Hellwig","MGC Dormagen-Brechten e.V.","","","","","",""]
[596,"Sw 1","Anja","Helmes","1. BGC Wesseling 1975 e.V.","","","","","",""]
[6117,"Sm 2","Willi","Helmschmidt","MGC Ingolstadt e.V.","","","","","",""]
[66740,"Sm 1","Andreas","Hemmelmann","MGC Wertheim 91 e.V.","","","","","",""]
[29993,"H","Martin","Hemmerling","TSV Pfungstadt Abt. Bahnengolf e.V.","","","","","",""]
[34042,"H","Ulli","Hengstberger","SSV Ulm 1846 Abt. Bahnengolf","","","","","",""]
[22909,"Sm 1","Ulrich","Hengstler","1. Bahnengolf-Club Singen e.V.","","","","","",""]
[41231,"Sw 1","Claudia","Hengstler","1. Bahnengolf-Club Singen e.V.","","","","","",""]
[34712,"H","Björn","Henke","MGC Freizeitzentrum Biebertal","","","","","",""]
[67274,"Sm 2","Eberhard","Henkel","BSG Pneumant Fürstenwalde e.V., Abt. Minigolf","","","","","",""]
[34118,"Sm 2","Klaus-Dieter","Henkel","MSV Bad Münder/Springe","Ja","12222","X","","","X"]
[2061,"Sm 2","Helmut","Henkel","SC Bad Münder","Ja","","","","",""]
[50094,"Sm 1","Holger","Hennies","BGC Hannover","Ja","","","","",""]
[66516,"D","Simone","Hennig-Becker","TSV Pfungstadt Abt. Bahnengolf e.V.","","","","","",""]
[36074,"Sw 2","Petra","Henschke","MGV Spandau","","","","","",""]
[29252,"H","Danny","Hense","SG Arheilgen Abt. Bahnengolf","","","","","",""]
[62946,"Sm 2","Josef","Hense","1. MGC Metzingen e.V.","","","","","",""]
[62945,"Sw 2","Ingrid","Hense","1. MGC Metzingen e.V.","","","","","",""]
[37011,"H","Tobias","Hensel","BSC Ennepetal e.V.","","","","","",""]
[40199,"H","Florian","Hensel","BSC Ennepetal e.V.","","","","","",""]
[66136,"Jm","Julian","Hensel","BSC Ennepetal e.V.","","","","","",""]
[66533,"Schw","Annika Sophia","Hensel","BSC Ennepetal e.V.","","","","","",""]
[46247,"Sm 1","Peter","Hensel","BSC Ennepetal e.V.","","","","","",""]
[48052,"Sw 1","Heike","Hensel","BSC Ennepetal e.V.","","","","","",""]
[65852,"Sm 2","Rainer","Henseler","1. MGC Paderborn e.V.","","","","","",""]
[40589,"Sm 1","Steffen","Hentschel","VfM e.V. Berlin ","","","","","",""]
[26232,"Sm 1","Andreas","Henze","MGC Göttingen","Ja","","","","",""]
[3564,"Sm 2","Karl","Herbich","MSK Olching e.V.","","","","","",""]
[34669,"H","Jan","Herbig","MC Ilvesheim e.V.","","","","","",""]
[42430,"Sm 2","Uwe","Herbig","BGSV Bad Homburg","","","","","",""]
[18029,"Sm 2","Lothar","Herfurt","MGV Spandau","","","","","",""]
[38180,"H","Albert","Hergesell","Reinickendorfer MGC e.V.","","","","","",""]
[38653,"Sm 1","Dirk","Hergesell","MGV Spandau","","","","","",""]
[31267,"H","Alexander","Hermann","1. MGC Mainz e.V.","","","","","",""]
[31268,"H","Max","Hermann","1. MGC Mainz e.V.","","","","","",""]
[67319,"Schm","David","Hermann","1. MGC Mainz e.V.","","","","","",""]
[6621,"Sm 2","Gerhard","Hermann","MGC Monrepos e.V.","","","","","",""]
[29935,"Sm 1","Marc","Herrmann","MGC Göttingen","Ja","","","","",""]
[67358,"Sw 1","Katharina","Herrmann","BSV 86 München e.V.","","","","","",""]
[28696,"Sm 2","Otmar","Herrmann","MGC Traben-Trarbach","","","","","",""]
[62403,"Sm 2","Achim","Hertzberg","MGC Dortmund Syburg e.V.","","","","","",""]
[6270,"Sw 2","Doris","Hertzberg","MGC Dortmund Syburg e.V.","","","","","",""]
[67127,"Sm 1","Frank","Herwig","MGC Göttingen","Ja","","","","",""]
[66935,"Sw 1","Heidi","Herz","1. MSC Hamburg-Neu Wulmstorf","","","","","",""]
[67379,"D","Eileen","Herzberger","BGSV Bad Homburg","","","","","",""]
[67198,"Schm","Philipp","Herzberger","BGSV Bad Homburg","","","","","",""]
[31952,"Sm 1","Sven","Herzberger","TG Höchberg von 1862 Bahnengolf e.V.","","","","","",""]
[67197,"Sm 1","Christof","Herzberger","BGSV Bad Homburg","","","","","",""]
[66284,"H","Tim","Herzer","SC Olympia Dortmund e.V.","","","","","",""]
[38197,"H","Frederik","Herzic","1. MGC Metzingen e.V.","","","","","",""]
[50402,"Sm 1","Hagen","Herzog","MGF Magdeburg 1995 e.V.","","","","","",""]
[46823,"Sm 1","Ralf","Herzog","TSV Pfungstadt Abt. Bahnengolf e.V.","","","","","",""]
[34103,"Sw 2","Sigrid","Hesker","MGC Bergisch Gladbach Gierath e.V.","","","","","",""]
[67389,"H","Steffen","Hess","BGC Schweinfurt e.V.","","","","","",""]
[33843,"H","Danny","Hess","1. MGC Mainz e.V.","","","","","",""]
[44929,"Sm 1","Rainer","Hess","SG Arheilgen Abt. Bahnengolf","","","","","",""]
[17936,"Sm 2","Erich","Hess","SG Arheilgen Abt. Bahnengolf","","","","","",""]
[3600,"Sw 2","Renate","Hess","SG Arheilgen Abt. Bahnengolf","","","","","",""]
[3863,"Sm 2","Dietmar","Hesse","BGC Goslar","Ja","3886","","X","",""]
[29405,"Sw 2","Karin","Hesse","BGC Goslar","Ja","9181","","","","X"]
[67076,"D","Jaqueline","Hesse-Butter","SC Bastion Rot Weiß Lippstadt e.V.","","","","","",""]
[34749,"D","Sandra","Hess-Struchen","SG Arheilgen Abt. Bahnengolf","","","","","",""]
[35237,"H","Robin","Hettrich","MGC Dormagen-Brechten e.V.","","","","","",""]
[35236,"Sm 2","Willi","Hettrich","BGSV Castrop e.V. 1961","","","","","",""]
[38602,"H","Bernd","Heublein","1. FMGC Lichtenfels 1961 e.V.","","","","","",""]
[19478,"Sw 1","Andrea","Heublein","1. FMGC Lichtenfels 1961 e.V.","","","","","",""]
[30655,"Sw 1","Silvia","Heublein","MGC Göttingen","Ja","","","","",""]
[37959,"H","Florian","Heuer","Preetzer TSV von 1861 e.V. Abt. Minigolf","","","","","",""]
[66345,"H","Andreas","Heuser","MGC Bad Bodendorf e.V.","","","","","",""]
[32292,"H","Wolfgang","Hewel","1. MGC Saar 68 St. Ingbert e.V.","","","","","",""]
[33308,"Sm 2","Helmut","Hewel","1. MGC Saar 68 St. Ingbert e.V.","","","","","",""]
[33309,"Sw 2","Marliese","Hewel","1. MGC Saar 68 St. Ingbert e.V.","","","","","",""]
[33530,"H","Marcus","Hey","OMGC Ingolstadt e.V.","","","","","",""]
[66433,"H","Markus","Heyber","MGC Kassel","Ja","","","","",""]
[5326,"Sm 2","Rudolf","Heydenreich","MGC Traben-Trarbach","","","","","",""]
[49901,"H","Christian","Heyder","BGC Bad Berneck e.V.","","","","","",""]
[6367,"Sw 2","Angelika","Heyder","MGC Murnau am Staffelsee e.V.","","","","","",""]
[40457,"Sm 1","Torsten","Heydt","MGC Olympia Kiel e.V.","","","","","",""]
[44771,"Sm 1","Lars","Heydt","MGC Olympia Kiel e.V.","","","","","",""]
[37254,"Sm 1","Hans Bernd","Heyer","MGC Bergisch Gladbach Gierath e.V.","","","","","",""]
[20291,"Sm 2","Peter","Heynen","BGC Celle","Ja","6320","","","","X"]
[46250,"Sm 2","Peter","Hickert","MGC \"AS\" Witten 1963 e.V.","","","","","",""]
[67054,"Sw 2","Ursula","Hiebsch","BV Sennestadt","","","","","",""]
[46885,"Sm 1","Manfred","Hiepp","MGF Ottobrunn e.V.","","","","","",""]
[5839,"Sm 2","Georg","Hilbert","1. MGC Epe 1978 e.V.","","","","","",""]
[66659,"Jm","Justin","Hildebrandt","BGS Hardenberg-Pötter e.V.","","","","","",""]
[38437,"Sm 1","Andreas","Hildebrandt","SV Gebhardshagen","Ja","","","","",""]
[5040,"Sm 2","Hans-Georg","Hildenbrand","BSV 82 Ohlsbach e.V.","","","","","",""]
[27536,"H","Christian","Hilgenberg","MGC Kassel","Ja","","","","",""]
[5289,"Sw 2","Ursula","Hillebrecht","MGC Göttingen","Ja","","","","",""]
[50172,"Sm 1","Reinhold","Hilß","1. MC Weinheim e.V.","","","","","",""]
[45368,"H","Klaus","Hiltner","MSG Kempten e.V.","","","","","",""]
[67203,"Jm","Eyk Sven","Hinke","BGC Leipzig","","","","","",""]
[26579,"Sm 1","Holger","Hinsel","MSF Brilon e.V.","","","","","",""]
[66442,"Jm","Raphael","Hintermeier","BGC Neutraubling e.V.","","","","","",""]
[49154,"Sm 1","Paul","Hirle","MSC Blau-Weiß 2003 München e.V.","","","","","",""]
[67221,"Sm 2","Werner","Hirsch","BGC Oberhausen e.V.","","","","","",""]
[38170,"Sm 1","Peter","Hisserich","BGSV Bad Homburg","","","","","",""]
[37644,"D","Rebecca","Hoch","MGC Dormagen-Brechten e.V.","","","","","",""]
[25846,"Sm 1","Raimund","Hoch","BGSV Kerpen e.V.","","","","","",""]
[3127,"Sm 2","Bruno","Hoch","BGSV Kerpen e.V.","","","","","",""]
[67336,"Schm","Markus","Höcherl","MGC Murnau am Staffelsee e.V.","","","","","",""]
[49074,"Sm 1","Michael","Hoefig","HMC Büttgen e.V.","","","","","",""]
[49067,"Sw 2","Hildegard","Hoefig","HMC Büttgen e.V.","","","","","",""]
[27994,"Sm 2","Heinz","Höferlin","BSV Inzlingen 1979 e.V.","","","","","",""]
[40282,"Sm 1","Jörg","Hoffmann","MGC Bergisch Gladbach Gierath e.V.","","","","","",""]
[42242,"Sm 1","Carsten","Hoffmann","MSC Herscheid 1963 e.V.","","","","","",""]
[42946,"Sm 1","Martin","Hoffmann","1. Porzer MGC Grün-Weiß 1969 e.V.","","","","","",""]
[67270,"Sm 2","Gerd","Hoffmann","BSG Pneumant Fürstenwalde e.V., Abt. Minigolf","","","","","",""]
[33647,"Sm 2","Andreas","Hoffmann","MSV Würzburg-Löwenbrücke e.V.","","","","","",""]
[3253,"Sm 2","Klaus-Peter","Hoffmann","MGV Bremen","Ja","","","","",""]
[5093,"Sm 2","Helmut","Hoffmann","MSC Bad Godesberg e.V.","","","","","",""]
[40278,"Sm 2","Joachim","Hoffmann","MGC Bergisch Gladbach Gierath e.V.","","","","","",""]
[60566,"Sm 2","Helmut-Karl","Hoffmann","MGC Bergisch Gladbach Gierath e.V.","","","","","",""]
[36636,"H","Thomas","Höfler","1. KC Homburg-Saar 1967 e.V.","","","","","",""]
[30938,"H","Michael","Hofmann","MC Ilvesheim e.V.","","","","","",""]
[66000,"H","Yannick","Hofmann","ASV Pegnitz, Abt. Minigolf","","","","","",""]
[35619,"H","Benjamin","Hofmann","1. MGSV Netphen e.V.","","","","","",""]
[66001,"Jm","Fabian","Hofmann","ASV Pegnitz, Abt. Minigolf","","","","","",""]
[66263,"Sm 1","Klaus","Hofmann","ASV Pegnitz, Abt. Minigolf","","","","","",""]
[66984,"D","Melanie","Hofmeister","MGF Ottobrunn e.V.","","","","","",""]
[66985,"Sw 1","Karin","Hofmeister","MGF Ottobrunn e.V.","","","","","",""]
[66986,"Sm 2","Helmut","Hofmeister","MGF Ottobrunn e.V.","","","","","",""]
[65213,"Sm 2","Jean-Daniel","Hofstetter","MGF Waldshut 74 e.V.","","","","","",""]
[34294,"D","Tamara","Hohenadler","MGC Bad Feilnbach e.V.","","","","","",""]
[65319,"Schw","Annalena","Hohenadler","MGC Bad Feilnbach e.V.","","","","","",""]
[40858,"Sm 1","Markus","Hohenadler","MGC Bad Feilnbach e.V.","","","","","",""]
[66702,"Schm","Paul","Hohmann","BGC Uerdingen e.V.","","","","","",""]
[66093,"Sw 1","Christine","Hohmann","BGC Hannover","Ja","","","","",""]
[4513,"Sm 2","Edgard","Höhmann","MGC Kassel","Ja","","","","",""]
[66377,"Jm","Marius","Hohmeier","MGC Bad Salzuflen e.V.","","","","","",""]
[66664,"H","Dennis","Hohn","HMC Büttgen e.V.","","","","","",""]
[66939,"Jm","Mika","Hohn","Hamburger MC von 1965 e.V.","","","","","",""]
[38498,"Sm 1","Marko","Hohn","Hamburger MC von 1965 e.V.","","","","","",""]
[6522,"Sm 2","Holger","Hohnke","MGC Olympia Kiel e.V.","","","","","",""]
[36460,"H","Hans-Joachim","Höhnke","MV Lankwitzer Dragons","","","","","",""]
[66955,"Jw","Carlotta","Höing","VfB Osnabrück e.V.","","","","","",""]
[66922,"D","Martina","Hoiss","Minigolf-Club Diessen","","","","","",""]
[66694,"Sm 1","Georg","Hoiss","Minigolf-Club Diessen","","","","","",""]
[38118,"Sw 1","Claudia","Holderberg","BGSC Bochum 1978 e.V.","","","","","",""]
[38119,"Sm 2","Hans-Peter","Holderberg","BGSC Bochum 1978 e.V.","","","","","",""]
[67165,"D","Birte","Hollensteiner","BV Sennestadt","","","","","",""]
[66869,"Sm 2","Dieter","Hollwedel","MGV Bremen","Ja","","","","",""]
[37720,"H","Frederik","Holtz","1. Minigolf-Club Rheinhausen e.V.","","","","","",""]
[42793,"Sm 1","Edgar","Holtz","1. Minigolf-Club Rheinhausen e.V.","","","","","",""]
[38028,"Sm 1","Peter","Holtz","1. Minigolf-Club Rheinhausen e.V.","","","","","",""]
[66728,"Sm 2","Florian","Holtzmann","1. MGC Köln 1961 e.V.","","","","","",""]
[66732,"H","Sascha","Holzenthal","1. MGC Mainz e.V.","","","","","",""]
[5746,"Sm 2","Lothar","Homey","1. Essener CGC \"Blau-Gold\" e.V.","","","","","",""]
[67033,"Sm 2","Wolfgang","Hommel","MGC Olympia Kiel e.V.","","","","","",""]
[37494,"Sm 1","Frank","Honerkamp","Bochumer Minigolf-Club 1960 e.V.","","","","","",""]
[63691,"H","Ronny","Hönicke","MGC \"Stahlquelle\" Bad Bocklet","","","","","",""]
[63702,"H","Marcel","Hönicke","MGC \"Stahlquelle\" Bad Bocklet","","","","","",""]
[66357,"H","Marco","Hönicke","MGC \"Stahlquelle\" Bad Bocklet","","","","","",""]
[49860,"Sm 2","Ludger","Honnacker","MGC Felderbachtal 1964 e.V.","","","","","",""]
[23187,"Sm 2","Peter","Honnef","1. MGC Ludwigshafen e.V.","","","","","",""]
[36467,"Sm 2","Karl Heinz","Hönscheid","1. BGC Wesseling 1975 e.V.","","","","","",""]
[66979,"Schm","Luca","Hoock","1. MGC Ladenburg e.V.","","","","","",""]
[30377,"H","Björn","Hoogen","VfB Osnabrück e.V.","","","","","",""]
[36777,"H","Sven","Hoogen","VfB Osnabrück e.V.","","","","","",""]
[48944,"H","Ingo","Hoogen","VfB Osnabrück e.V.","","","","","",""]
[66793,"Schw","Lena","Hoogen","VfB Osnabrück e.V.","","","","","",""]
[40538,"Sm 2","Wilfried","Hoose","BGS Hardenberg-Pötter e.V.","","","","","",""]
[30608,"Sm 1","Bernhard","Höötmann","BGC Hannover","Ja","","","","",""]
[35130,"Sm 1","Carsten","Höpfner","BGC Northeim","Ja","","","","",""]
[40166,"Sm 1","Mario","Höpfner","TSV Kücknitz Abt. Bahnengolf","","","","","",""]
[46612,"Sm 2","Peter","Höpner","BGS Hardenberg-Pötter e.V.","","","","","",""]
[38276,"Sm 2","Peter","Hopp","SSC Halver e.V.","","","","","",""]
[37752,"Sm 1","Mike","Hoppe","MGF Magdeburg 1995 e.V.","","","","","",""]
[67299,"Sm 1","Daniel","Hoppe","KSV Baltrum e.V.","","","","","",""]
[37753,"Sm 2","Manfred","Hoppe","MGF Magdeburg 1995 e.V.","","","","","",""]
[43419,"Sm 1","Mario","Hopperdietzel","1. MGC Mitterteich-Großbüchlberg","","","","","",""]
[42335,"Sm 2","Alexander","Horbas","MGC Ingolstadt e.V.","","","","","",""]
[67186,"Jm","Benedikt","Hörburger","MSG Kempten e.V.","","","","","",""]
[38145,"Sw 1","Claudia","Horeis","MGC Bergisch Gladbach Gierath e.V.","","","","","",""]
[38146,"Sm 2","Kai","Horeis","MGC Bergisch Gladbach Gierath e.V.","","","","","",""]
[27888,"H","Armin","Hörl","MGF Hammer e.V.","","","","","",""]
[38030,"H","Kilian","Horn","MSV Bad Kreuznach","","","","","",""]
[50002,"Sm 1","Dennis","Horn","BGC Diepholz","Ja","","","","",""]
[66342,"Sm 1","Dieter","Horn","MGC Peine","Ja","","","","",""]
[66341,"Sw 2","Angelika","Horn","MGC Peine","Ja","","","","",""]
[45305,"Sm 1","Frank","Hornberger","SV Lurup Abt. Bahnengolf","","","","","",""]
[60777,"Sm 2","Edwin","Hörnlen","MGSC Wernau e.V.","","","","","",""]
[33961,"Sm 2","Gerhard","Horsinka","MC Flora Elmshorn e.V.","","","","","",""]
[38121,"H","Valentin","Horst","SG Arheilgen Abt. Bahnengolf","","","","","",""]
[67088,"Jm","Matthis","Hötzel","BGSV Castrop e.V. 1961","","","","","",""]
[24610,"H","Kai","Hövel","VfM Bottrop e.V.","","","","","",""]
[67280,"Schm","Yannik","Hoyer","1. MGC Mitterteich-Großbüchlberg","","","","","",""]
[38389,"H","Eric","Huber","BGSV Bad Homburg","","","","","",""]
[66932,"H","Aaron","Huber","BGSV Bad Homburg","","","","","",""]
[38355,"H","Ronny","Huber","BGC Heilbronn e.V.","","","","","",""]
[47050,"Sm 1","Klaus","Huber","MGC Wolnzach e.V.","","","","","",""]
[48107,"Sm 2","Karl-Heinz","Huber","1. BGC Landshut e.V.","","","","","",""]
[66882,"Schm","Kevin","Hubrecht","MC Flora Elmshorn e.V.","","","","","",""]
[32871,"Sm 1","Peter","Hubrecht","MC Flora Elmshorn e.V.","","","","","",""]
[67248,"H","Luca","Hudert","BGSV Bad Homburg","","","","","",""]
[38364,"H","Christopher","Hudman","MSV Würzburg-Löwenbrücke e.V.","","","","","",""]
[33867,"Sm 2","Karl-Heinz","Hufnagl","MGC Ingolstadt e.V.","","","","","",""]
[7524,"Sm 2","Klaus","Hufschmidt","BGSC \"Gut Schlag\" Gladbeck e.V.","","","","","",""]
[30013,"H","Michael","Huhn","BGC Heilbronn e.V.","","","","","",""]
[6300,"Sm 2","Klaus","Huhn","BGC Heilbronn e.V.","","","","","",""]
[47019,"Sw 2","Martina","Huhn","BGC Bad Mergentheim e.V.","","","","","",""]
[49297,"Sm 2","Wolfgang","Hühne","MGC Kassel","Ja","","","","",""]
[32803,"H","Marcell","Humbek","MGC \"Stahlquelle\" Bad Bocklet","","","","","",""]
[36485,"H","Sascha-Nico","Humbek","MGC \"Stahlquelle\" Bad Bocklet","","","","","",""]
[63553,"D","Jeanette","Humbek-Hönicke","MGC \"Stahlquelle\" Bad Bocklet","","","","","",""]
[63418,"Sw 2","Sybille","Humburg","1. MGC Saar 68 St. Ingbert e.V.","","","","","",""]
[35857,"Sm 2","Manfred","Hundsdorf","1. MGC Mannheim 1968 e.V.","","","","","",""]
[35858,"Sw 2","Annemarie","Hundsdorf","1. MGC Mannheim 1968 e.V.","","","","","",""]
[67010,"Sm 2","Dieter","Hundt","SSC Attendorn e.V.","","","","","",""]
[44723,"Sm 1","Karl-Heinz","Hunte","BGC Diepholz","Ja","","","","",""]
[40603,"Sw 1","Stefanie","Hunte","BGC Diepholz","Ja","16468","","X","",""]
[5258,"Sm 2","Josef","Hupfloher","1. Münchener MGC e.V.","","","","","",""]
[65120,"Sm 2","Norbert","Hupka","MGC Bad Homburg vdH e.V.","","","","","",""]
[27615,"Sm 1","Martin","Hüppen","Bochumer Minigolf-Club 1960 e.V.","","","","","",""]
[46235,"Sm 1","Ulrich","Hürter","MSC Bad Godesberg e.V.","","","","","",""]
[66173,"Sm 1","Fred","Huse","Elbhavelland e.V., Abt. Minigolfsport","","","","","",""]
[35406,"H","Marcel","Hüsges","MC Möve Cuxhaven","Ja","13506","X","","",""]
[67058,"Sm 1","Ralf","Hüther","MGC Heringen 1997 e.V.","","","","","",""]
[40165,"H","Marcel","Hütter","1. Duisburger Minigolf Club 1962 e.V.","","","","","",""]
[38569,"D","Natascha","Hütter","1. Duisburger Minigolf Club 1962 e.V.","","","","","",""]
[67354,"Schm","Bastian","Hüttl","MGF Ottobrunn e.V.","","","","","",""]
[4182,"Sw 2","Anneliese","Hutzler","1. NMC Kelheim e.V.","","","","","",""]
[38269,"Sm 1","Marcus","Hylak","MSC Bad Godesberg e.V.","","","","","",""]
[26659,"Sw 2","Reinhild","Hylak","MSC Bad Godesberg e.V.","","","","","",""]
[35568,"D","Marina","Iffland","MGC Rot-Weiß Wanne-Eickel e.V.","","","","","",""]
[35239,"Sm 2","Peter","Iffland","MGC Rot-Weiß Wanne-Eickel e.V.","","","","","",""]
[16225,"H","Marcus","Ihrlich","TSV Kücknitz Abt. Bahnengolf","","","","","",""]
[48686,"Sm 1","Thomas","Ill","MGC Ravensburg-Weingarten e.V.","","","","","",""]
[67096,"Jm","Marcel","Immenschuh","BSV 82 Ohlsbach e.V.","","","","","",""]
[26834,"Sm 2","Alfred","Inck","MGC Bergisch Gladbach Gierath e.V.","","","","","",""]
[44954,"Sw 2","Alwine","Inck","MGC Bergisch Gladbach Gierath e.V.","","","","","",""]
[27702,"Sm 2","Bruno","Ingenston","1. Berliner Miniaturgolf-Sportclub e.V. 1960","","","","","",""]
[61325,"Sw 2","Rose-Marie","Ipach","MGC Brunsbüttel e.V.","","","","","",""]
[40541,"Sm 1","Oliver","Isenbiel","MSC Bensheim-Auerbach e.V.","","","","","",""]
[33586,"D","Marion","Isop","VfL Lohbrügge Abt. Bahnengolf","","","","","",""]
[31002,"Sw 1","Kirsten","Isselmann","MSK Neheim-Hüsten e.V.","","","","","",""]
[63326,"Sm 2","Werner","Isselmann","1. MSC Wesel 6.6.1966 e.V.","","","","","",""]
[46453,"H","Marcus","Itjen","MC Möve Cuxhaven","Ja","","","","",""]
[66797,"H","Patrick","Itter","BGC Neutraubling e.V.","","","","","",""]
[30373,"Sm 1","Holger","Ittner","MSK Neheim-Hüsten e.V.","","","","","",""]
[66406,"Sm 2","Peter","Izelle","BSC Ennepetal e.V.","","","","","",""]
[43158,"Sm 1","Ingo","Jablonowski","BGSC Bochum 1978 e.V.","","","","","",""]
[46049,"H","Jesko","Jachens","MGC Olympia Kiel e.V.","","","","","",""]
[18069,"Sm 2","Franz","Jachert","MGSC Wernau e.V.","","","","","",""]
[33011,"H","Christopher","Jäck","1. Bahnengolf-Club Singen e.V.","","","","","",""]
[34687,"Sm 2","Wolfram","Jäck","MGF Hilzingen 80 e.V.","","","","","",""]
[47260,"Sm 1","Frank","Jacobi","MGC Bad Salzuflen e.V.","","","","","",""]
[35317,"H","Marco","Jacobs","TSV Arendsee e.V.","","","","","",""]
[1742,"Sm 1","Ralf","Jacobs","TSV Arendsee e.V.","","","","","",""]
[35316,"Sm 1","Jörg","Jacobs","TSV Arendsee e.V.","","","","","",""]
[36699,"Sm 2","Gerhard","Jaenichen","VFB 21 Neugattersleben e. V.","","","","","",""]
[36447,"Sm 1","Thomas","Jäger","Bochumer Minigolf-Club 1960 e.V.","","","","","",""]
[6372,"Sm 2","Peter","Jäger","1. BGC Landshut e.V.","","","","","",""]
[24766,"Sm 2","Bernd","Jäger","MGC Bad Hersfeld","","","","","",""]
[40980,"Sm 2","Michael","Jäger","BGSV Bad Homburg","","","","","",""]
[38313,"Sw 2","Gisela","Jäger","MGC Dortmund Syburg e.V.","","","","","",""]
[42951,"Sm 1","Achim","Jahr","MGC Oberkochen e.V.","","","","","",""]
[24925,"Sm 2","Konrad","Jahr","MGC Göttingen","Ja","","","","",""]
[44499,"Sw 2","Uta","Jahrmärker","BGC Celle","Ja","18570","","X","",""]
[45789,"H","Christian","Jäink","MSK Neheim-Hüsten e.V.","","","","","",""]
[66863,"H","Andre","Jaiser","MCE Sindelfingen e.V.","","","","","",""]
[66485,"Sm 1","Rudi","Jakab","1. BGC Bad Füssing e.V.","","","","","",""]
[41217,"Sm 2","Franz","Jakob","MGC Ingolstadt e.V.","","","","","",""]
[66119,"Sm 2","Norbert","Jakob","BGSV Bad Homburg","","","","","",""]
[67141,"H","Jens","Jakobs","MGC Traben-Trarbach","","","","","",""]
[33405,"H","Timo","Jakoby","MGC Traben-Trarbach","","","","","",""]
[66652,"H","Rene","Jakubeit","VfL Lüneburg","Ja","","","","",""]
[67208,"D","Janine","Jander","MGC Marl 1960 e.V.","","","","","",""]
[29585,"Sm 1","André","Jänicke","MGC Dormagen-Brechten e.V.","","","","","",""]
[37822,"H","Andreas","Jansen","MGC Bergisch Gladbach Gierath e.V.","","","","","",""]
[36046,"Sm 1","Thomas","Jansen","MGC Ingolstadt e.V.","","","","","",""]
[24340,"Sm 2","Jörg","Jansen","VfM Bottrop e.V.","","","","","",""]
[31015,"Sm 1","Markus","Janßen","1. MGC Mainz e.V.","","","","","",""]
[66147,"Sw 1","Petra","Janßen","SV Lurup Abt. Bahnengolf","","","","","",""]
[67236,"H","Sven","Janz","1. CGC Blau-Gelb Grötzingen","","","","","",""]
[29771,"Sm 1","Klaus","Jarosch","VfM Bottrop e.V.","","","","","",""]
[34756,"Sw 2","Monika","Jarzembowski","MGC Olympia Kiel e.V.","","","","","",""]
[37450,"Sw 2","Ilka","Jäschke-Ladendorf","BGSV Bad Homburg","","","","","",""]
[37433,"Sm 1","Alexander","Jasper","MGC Dormagen-Brechten e.V.","","","","","",""]
[66179,"H","Jens","Jatho","BGC Hannover","Ja","","","","",""]
[66845,"H","Michael","Jauernek","MGC Monrepos e.V.","","","","","",""]
[40383,"H","Robert","Jeckel","BGC Leipzig","","","","","",""]
[66825,"H","Martin","Jecny","BGS Hardenberg-Pötter e.V.","","","","","",""]
[46846,"H","André","Jensen","MGC Olympia Kiel e.V.","","","","","",""]
[33394,"Sm 1","Bernd","Jentschke","MGC Unterschneidheim e.V.","","","","","",""]
[34568,"H","Sebastian","Jeschke","MSC Bad Godesberg e.V.","","","","","",""]
[36293,"D","Anna","Jeske","SV Lurup Abt. Bahnengolf","","","","","",""]
[61958,"Sw 2","Marie-Luise","Jezierski","MGC \"AS\" Witten 1963 e.V.","","","","","",""]
[26456,"Sm 2","Erwin","Joachimsthaler","MGC Ostheim / Rhön e.V.","","","","","",""]
[62655,"Sm 2","Horst","Jockel","BGC Bad Mergentheim e.V.","","","","","",""]
[46843,"H","Niels","Johannsen","MGC Harrislee-Wassersleben","","","","","",""]
[40896,"Sm 2","Manfred","Jöhrens","BGC Hannover","Ja","","","","",""]
[28802,"Sw 1","Melanie","Jooß","BGC Illertissen e.V.","","","","","",""]
[28793,"Sm 2","Thomas","Jooß","BGC Illertissen e.V.","","","","","",""]
[67200,"Sm 1","Oliver","Jordan","BGSV Bad Homburg","","","","","",""]
[40687,"Sm 1","Nikolai","Juchem","1. MGC Mainz e.V.","","","","","",""]
[37937,"H","Marco","Jung","MGC Murnau am Staffelsee e.V.","","","","","",""]
[35510,"H","Jürgen","Jung","VfB Limbach 2000 e.V.","","","","","",""]
[30969,"D","Claudia","Jung","MGC Murnau am Staffelsee e.V.","","","","","",""]
[66017,"Jw","Johanna","Jung","1. KC Homburg-Saar 1967 e.V.","","","","","",""]
[66933,"Schm","Samuel","Jung","SV 1890 e.V. Dreieichenhain, Abt. Bahnengolf","","","","","",""]
[40003,"Sm 1","Markus","Jung","BGV Bergisch Land 1962 / 63 e.V.","","","","","",""]
[66018,"Sm 1","Jürgen","Jung","1. KC Homburg-Saar 1967 e.V.","","","","","",""]
[67262,"Sw 1","Barbara","Jung","MGC \"Stahlquelle\" Bad Bocklet","","","","","",""]
[34878,"Sm 2","Horst","Jung","MGC Millennium Lorsch e.V.","","","","","",""]
[3578,"Sw 2","Lieselotte","Jung","BGC Dormagen e.V.","","","","","",""]
[66806,"Sm 1","Thomas","Jüngling","1.KGC Mönchengladbach e.V.","","","","","",""]
[66050,"H","Sven","Jungwirth","SSC Attendorn e.V.","","","","","",""]
[49073,"H","Alexander","Junkermann","MGC Dormagen-Brechten e.V.","","","","","",""]
[38338,"Jw","Melanie","Jurgeleit","MGC Murnau am Staffelsee e.V.","","","","","",""]
[38337,"Sm 1","Bernd","Jurgeleit","BSV 86 München e.V.","","","","","",""]
[38339,"Sw 1","Rebecca","Jurgeleit","BSV 86 München e.V.","","","","","",""]
[66717,"Sm 1","Klaus-Dieter","Jürgens","BGC Hannover","Ja","","","","",""]
[67142,"Schm","Jan Uwe","Jürgensen","BGC Illertissen e.V.","","","","","",""]
[43273,"Sm 1","Ralf","Jürgensen","SSV Ulm 1846 Abt. Bahnengolf","","","","","",""]
[34656,"H","Heiko","Jürs","MC Flora Elmshorn e.V.","","","","","",""]
[46052,"H","Mario","Jürs","MC Flora Elmshorn e.V.","","","","","",""]
[65559,"Jm","Daniel","Jürs","MC Flora Elmshorn e.V.","","","","","",""]
[43508,"Sm 2","Dieter","Jürs","MC Flora Elmshorn e.V.","","","","","",""]
[43515,"Sw 2","Gabriele","Jürs","MC Flora Elmshorn e.V.","","","","","",""]
[29850,"Sm 1","Michael","Just","1. MGC Süßen e.V.","","","","","",""]
[66282,"H","Stephan","Jütte","1. MGC Paderborn e.V.","","","","","",""]
[37352,"Sm 1","Karsten","Käckenmester","BGC Bremen","Ja","","","","",""]
[37468,"Sw 1","Annette","Kaestner","Reinickendorfer MGC e.V.","","","","","",""]
[46699,"Sm 1","Thomas","Kaiser","MSF Brilon e.V.","","","","","",""]
[35182,"Sm 2","Herbert","Kaiser","BSV 86 München e.V.","","","","","",""]
[43405,"Sm 2","Michael","Kaiser","BGSV Bad Homburg","","","","","",""]
[46573,"H","Sascha","Kaisr","BGSV Aßlar 1987 e.V.","","","","","",""]
[66302,"Sm 2","Alois","Kaisr","BGSV Aßlar 1987 e.V.","","","","","",""]
[66290,"Jm","Lukas","Kalb","1. FMGC Lichtenfels 1961 e.V.","","","","","",""]
[4222,"Sw 2","Anna","Kalhöfer","MGC \"AS\" Witten 1963 e.V.","","","","","",""]
[4455,"Sm 2","Manfred","Kalisch","BGSV Aßlar 1987 e.V.","","","","","",""]
[42648,"Sm 1","Roland","Kalka","MSK Olching e.V.","","","","","",""]
[34231,"D","Antje","Kalkbrenner","MGC Bad Salzuflen e.V.","","","","","",""]
[67030,"D","Daria Anasthasia Larissa Christa","Kamke","BGC Oberhausen e.V.","","","","","",""]
[67360,"D","Katja","Kammermaier","BSV 86 München e.V.","","","","","",""]
[35257,"Sw 2","Cornelia","Kampe","TSV Salzgitter","Ja","","","","",""]
[45597,"Sm 1","Michael","Kampmann","MGC Bad Salzuflen e.V.","","","","","",""]
[65827,"H","Jan-Kevin","Kampschulte","SSC Attendorn e.V.","","","","","",""]
[40227,"Sm 1","Frank","Kampschulte","SSC Attendorn e.V.","","","","","",""]
[66910,"Jm","Hannes","Kandert","TG Höchberg von 1862 Bahnengolf e.V.","","","","","",""]
[38341,"Sm 2","Harald","Kantor","BGSV Bad Homburg","","","","","",""]
[29934,"Sw 2","Vera","Kapelle-Schürings","MGC Göttingen","Ja","9528","","","",""]
[35774,"H","Dennis","Kapke","SG Arheilgen Abt. Bahnengolf","","","","","",""]
[36105,"Sm 1","Hans-Jürgen","Karas","Minigolfclub Karlshagen e.V.","","","","","",""]
[28575,"Sw 2","Gabriele","Karas","1. MSC Hamburg-Neu Wulmstorf","","","","","",""]
[29752,"Sm 1","Bruno","Karcher","1. MGC Tuttlingen e.V.","","","","","",""]
[66886,"Sm 2","Werner","Karcher","BGC Rheinau-Freistett e.V.","","","","","",""]
[40087,"Sm 1","Karl","Karduck","1. Münchener MGC e.V.","","","","","",""]
[29374,"Sm 1","Jürgen","Karl","MC Ilvesheim e.V.","","","","","",""]
[25466,"Sm 1","Klaus","Karlitschek","1. MGC Metzingen e.V.","","","","","",""]
[18344,"Sm 2","Winfried","Karpa","BGV Backumer Tal Herten e.V.","","","","","",""]
[27122,"Sm 2","Detlef","Kasburg","MGC Peine","Ja","","","","",""]
[46970,"Sm 1","Ralf","Käsler","BGC Uerdingen e.V.","","","","","",""]
[30576,"Sm 1","Stefan","Kaspar","BSV 82 Ohlsbach e.V.","","","","","",""]
[34120,"Sm 2","Harald","Kaßner","SC Bad Münder","Ja","","","","",""]
[38144,"Sm 1","Holger","Kastner","1. MSC Wesel 6.6.1966 e.V.","","","","","",""]
[67235,"H","Fabian","Kauss","BGC Celle","Ja","","","","",""]
[31250,"Sm 1","Thomas","Kegel","MGC Ostheim / Rhön e.V.","","","","","",""]
[26465,"Sm 2","Roland","Kehl","SGC Hagen e.V.","","","","","",""]
[30337,"Sm 1","Karsten","Kehr","BGC Northeim","Ja","","","","",""]
[6360,"Sm 2","Hermann","Kehrer","1. MGC Metzingen e.V.","","","","","",""]
[46465,"H","Sven","Keiper","1. MGC Oberthal e.V.","","","","","",""]
[66195,"D","Chantal","Keiper","1. MGC Oberthal e.V.","","","","","",""]
[66232,"Sw 2","Ingrid","Keiper","1. MGC Oberthal e.V.","","","","","",""]
[67351,"Sw 1","Marita","Keith","MGC Heven e.V.","","","","","",""]
[24022,"Sm 1","Andreas","Kelch","Tempelhofer MV Berlin e.V.","","","","","",""]
[29738,"Sm 1","Frank","Keller","TG Höchberg von 1862 Bahnengolf e.V.","","","","","",""]
[67050,"Sm 1","Markus","Keller","Bochumer Minigolf-Club 1960 e.V.","","","","","",""]
[48285,"Sm 2","Franz","Keller","MGC Murnau am Staffelsee e.V.","","","","","",""]
[5767,"Sm 2","Toni","Keller","VfB Limbach 2000 e.V.","","","","","",""]
[31656,"D","Marietheres","Kellner","BGC Celle","Ja","","","","",""]
[22366,"Sw 1","Karin","Kellner","MGC Oberkochen e.V.","","","","","",""]
[19630,"Sm 2","Rudolf","Kellner","MGC Oberkochen e.V.","","","","","",""]
[50151,"H","Christian","Kemler","1.KGC Mönchengladbach e.V.","","","","","",""]
[30988,"Sm 1","Norbert","Kempa","BGC Wolfsburg","Ja","","","","",""]
[5802,"Sm 2","Kurt","Kempa","1. BGC Paderborn e.V.","","","","","",""]
[955,"Sw 2","Marina","Kempa","BGC Wolfsburg","Ja","","","","",""]
[26658,"Sm 2","Manfred","Kempen","MSC Bad Godesberg e.V.","","","","","",""]
[36920,"H","Markus","Kempf","BGSV Kerpen e.V.","","","","","",""]
[37775,"D","Christin","Kemsies","BGV Bergisch Land 1962 / 63 e.V.","","","","","",""]
[41862,"Sm 1","Thomas","Kemsies","BGV Bergisch Land 1962 / 63 e.V.","","","","","",""]
[38620,"Sm 2","Lutz","Kemsies","Reinickendorfer MGC e.V.","","","","","",""]
[66655,"Sw 2","Regine","Kemsies","Reinickendorfer MGC e.V.","","","","","",""]
[42407,"Sm 1","Udo","Keppler","MGSC Wernau e.V.","","","","","",""]
[66536,"Sm 2","Jürgen","Kerk","Hamburger MC von 1965 e.V.","","","","","",""]
[67352,"Sm 2","Uwe","Kersch","MGC Heven e.V.","","","","","",""]
[67069,"H","Toni","Kersek","MSK Neheim-Hüsten e.V.","","","","","",""]
[5596,"Sm 2","Kurt","Kersting","MGC Kassel","Ja","4608","","X","",""]
[27324,"Sm 2","Peter","Kesselmeier","1. MGC Paderborn e.V.","","","","","",""]
[66397,"Sm 1","Jens","Kesting","Kölner Miniatur Golf Club e.V.","","","","","",""]
[67056,"H","Fabian","Kiefer","MGC Heringen 1997 e.V.","","","","","",""]
[48508,"Sm 1","Andreas","Kiefer","Tempelhofer MV Berlin e.V.","","","","","",""]
[36169,"Sm 2","Peter","Kiehl","MGC Bad Soden-Salmünster","","","","","",""]
[66748,"H","Stephan","Kiesling","BGC Hannover","Ja","","","","",""]
[4114,"Sm 2","Detlev","Kiesow","TSV Kücknitz Abt. Bahnengolf","","","","","",""]
[38332,"Sm 2","Georg","Kießling","BGC Schweinfurt e.V.","","","","","",""]
[40792,"Sm 1","Thilo","Killmaier","Miniaturgolf Sportclub Schriesheim e.V","","","","","",""]
[34130,"Sw 2","Christine","Killmaier","Miniaturgolf Sportclub Schriesheim e.V","","","","","",""]
[41160,"Sm 1","Oliver","Kindermann","1. MGC Ludwigshafen e.V.","","","","","",""]
[155,"Sm 2","Jörg Rainer","Kindt","MSV Bad Kreuznach","","","","","",""]
[48544,"Sm 2","Jörg","Kinnemann","MGC Göttingen","Ja","","","","",""]
[42971,"Sm 1","Rainer","Kirberg","HMC Büttgen e.V.","","","","","",""]
[29886,"Sm 1","Manfred","Kirch","1. BGC Wesseling 1975 e.V.","","","","","",""]
[66058,"Jm","Alexander","Kirchhofer","MGF Ottobrunn e.V.","","","","","",""]
[6110,"Sw 2","Dagmar","Kirchhoff-Freund","MGC Freizeitzentrum Biebertal","","","","","",""]
[22103,"Sw 2","Helga","Kirgasser","MC Neuwied","","","","","",""]
[36810,"Sm 1","Josef","Kirner","MGC Bad Feilnbach e.V.","","","","","",""]
[51586,"H","Stefan","Kirpal","BGC Bad Nenndorf","Ja","","","","",""]
[38456,"Sm 1","Michael","Kirschke","Reinickendorfer MGC e.V.","","","","","",""]
[67338,"H","Tobias","Kirscht","Hamburger MC von 1965 e.V.","","","","","",""]
[36686,"Sw 2","Rotraud","Kirstein","MSC Herscheid 1963 e.V.","","","","","",""]
[64051,"Sm 2","Emil","Kisel","MGF Steinbruch Kempten","","","","","",""]
[4892,"Sm 2","Franz","Kissenkötter","1. MGC Köln 1961 e.V.","","","","","",""]
[41439,"H","Stefan","Kitzeder","MSG Kempten e.V.","","","","","",""]
[67184,"Schm","Lukas","Kitzeder","MSG Kempten e.V.","","","","","",""]
[37762,"H","Michael","Kitzing","1. Bahnengolf-Club Singen e.V.","","","","","",""]
[36924,"Sm 1","Bernd","Klann","MGC Dormagen-Brechten e.V.","","","","","",""]
[3832,"Sm 2","Gerd","Klär","Freizeit Club Bliesen e.V.","","","","","",""]
[67327,"Sm 2","Heribert","Klarhold","1. BGC Paderborn e.V.","","","","","",""]
[25842,"Sm 2","Heinz","Kläsgen","MGC Freizeitzentrum Biebertal","","","","","",""]
[34826,"H","Oleg","Klassen","SG Arheilgen Abt. Bahnengolf","","","","","",""]
[4690,"Sm 2","Walter","Klauke","Miniaturgolf Sportclub Schriesheim e.V","","","","","",""]
[66597,"H","Thomas","Klaus","1. BGC Landshut e.V.","","","","","",""]
[66582,"Jw","Liana","Klaus","BGC Bremen","Ja","","","","",""]
[66581,"Sm 1","Sven","Klaus","BGC Bremen","Ja","","","","",""]
[36946,"H","Michael","Klee","1. KC Homburg-Saar 1967 e.V.","","","","","",""]
[36072,"Sm 1","Wolfgang","Klee","1. KC Homburg-Saar 1967 e.V.","","","","","",""]
[24092,"Sm 2","Hannes","Klee","MSC Bensheim-Auerbach e.V.","","","","","",""]
[34755,"Sw 2","Sigrid","Kleiber","SSV Ulm 1846 Abt. Bahnengolf","","","","","",""]
[48337,"H","Marcel","Klein","MGC putter Künzell 1970 e.V.","","","","","",""]
[38406,"H","Max","Klein","1. KC Homburg-Saar 1967 e.V.","","","","","",""]
[29324,"Sm 1","Wolfgang","Klein","1. MGSV Netphen e.V.","","","","","",""]
[40219,"Sm 1","Theo","Klein","SSC Halver e.V.","","","","","",""]
[46240,"Sm 1","Detlef","Klein","MGC Bad Salzuflen e.V.","","","","","",""]
[42309,"Sm 1","Chris","Klein","1. KC Homburg-Saar 1967 e.V.","","","","","",""]
[36474,"Sw 1","Sabine","Klein","HMC Büttgen e.V.","","","","","",""]
[42305,"Sw 1","Kerstin","Klein","MGC Bad Salzuflen e.V.","","","","","",""]
[19531,"Sm 2","Peter","Klein","MC Ilvesheim e.V.","","","","","",""]
[4762,"Sm 2","Helge","Klein","MSC Bad Godesberg e.V.","","","","","",""]
[7074,"Sm 2","Heinz Günter","Klein","1.KGC Mönchengladbach e.V.","","","","","",""]
[34653,"Sw 2","Antje","Klein","SC Gut Heil Neumünster e.V.","","","","","",""]
[38462,"H","Tristan","Kleiner","BGC Wolfsburg","Ja","","","","",""]
[38519,"H","Philipp","Kleiner","MSK Neheim-Hüsten e.V.","","","","","",""]
[38606,"Sm 1","Bernward","Kleiner","BGC Hannover","Ja","","","","",""]
[38607,"Sw 1","Sabine","Kleiner","BGC Hannover","Ja","","","","",""]
[66947,"Schm","Robin","Kleinke","SSC Attendorn e.V.","","","","","",""]
[37962,"H","Marc Dominik","Klemm","1. KC Homburg-Saar 1967 e.V.","","","","","",""]
[34738,"H","Andreas","Klemps","TV Niederstetten 1862 e.V.  Abt. Minigolf","","","","","",""]
[67232,"Schm","Felix","Klepzig","Minigolfclub Karlshagen e.V.","","","","","",""]
[182,"Sm 2","Michael","Kleyer","BGSV Castrop e.V. 1961","","","","","",""]
[6025,"Sm 2","Erich","Kleyer","BGSV Castrop e.V. 1961","","","","","",""]
[66511,"Sm 2","Peter","Kling","BGSC Bochum 1978 e.V.","","","","","",""]
[66510,"Sw 2","Martina","Kling","BGSC Bochum 1978 e.V.","","","","","",""]
[65814,"H","Björn","Klingelhöfer","CGC Rauschenberg e.V.","","","","","",""]
[24658,"Sm 2","Wilfried","Klipp","BV Sennestadt","","","","","",""]
[66309,"Schm","Lauro","Klöckener","MSK Neheim-Hüsten e.V.","","","","","",""]
[45785,"Sm 1","Sven","Klöckener","MSK Neheim-Hüsten e.V.","","","","","",""]
[45786,"Sw 1","Astrid","Klöckener","MSK Neheim-Hüsten e.V.","","","","","",""]
[5257,"Sw 2","Katharina","Klöhn","MGC Murnau am Staffelsee e.V.","","","","","",""]
[45781,"Sm 1","Olaf","Kloke","MSK Neheim-Hüsten e.V.","","","","","",""]
[33504,"H","Sebastian","Klosek","BGC Bad Nenndorf","Ja","","","","",""]
[65955,"H","Sascha","Klotz","BGSV Aßlar 1987 e.V.","","","","","",""]
[33187,"H","Christian","Klotz","1. MGC Süßen e.V.","","","","","",""]
[35375,"Sw 1","Sandra","Klotz","1. MGC Süßen e.V.","","","","","",""]
[34459,"Sm 1","Olaf","Kluck","MGC Nümbrecht e.V.","","","","","",""]
[3792,"Sm 2","Peter","Kluge","BGC Goslar","Ja","3852","","","",""]
[43187,"Sm 1","Joachim","Knapp","SG Arheilgen Abt. Bahnengolf","","","","","",""]
[21452,"Sm 1","Markus","Knauer","BGC Bremen","Ja","","","","",""]
[38039,"H","Nico","Knäulein","MGV Ansbach e.V.","","","","","",""]
[42756,"Sw 2","Monika","Knetsch","MGC Bad Bodendorf e.V.","","","","","",""]
[34707,"D","Corina","Knezevic","BGC Neutraubling e.V.","","","","","",""]
[36090,"D","Vanessea","Knezevic","BGC Neutraubling e.V.","","","","","",""]
[41828,"Sw 1","Katja","Kniesch","BGC Hannover","Ja","17133","","X","","X"]
[35356,"Sm 2","Dieter","Knietsch","MGC Peine","Ja","","","","",""]
[35357,"Sw 2","Teresa","Knietsch","MGC Peine","Ja","","","","",""]
[25352,"Sm 1","Ralf","Knippschild","1. MSC Wesel 6.6.1966 e.V.","","","","","",""]
[38155,"H","Jan","Knoblauch","BGSC \"Gut Schlag\" Gladbeck e.V.","","","","","",""]
[46684,"Sm 2","Wolfgang","Knoll","MC Ilvesheim e.V.","","","","","",""]
[35266,"Sw 2","Bianca","Knoll","MC Ilvesheim e.V.","","","","","",""]
[48641,"D","Nicole","Knöll-Grünenthal","TSV Pfungstadt Abt. Bahnengolf e.V.","","","","","",""]
[29869,"Sm 1","Dietmar","Knorr","BGC Schloß Paffendorf e.V.","","","","","",""]
[3935,"Sm 2","Helmut","Knott","BSV 86 München e.V.","","","","","",""]
[46124,"Sw 2","Irene","Knott","BSV 86 München e.V.","","","","","",""]
[67164,"Sm 1","Stefan","Knull","BV Sennestadt","","","","","",""]
[34163,"Sm 2","Michael","Knüppel","MGC Heringen 1997 e.V.","","","","","",""]
[25613,"Sm 1","Uwe","Knust","BGC Bad Nenndorf","Ja","7574","","X","","X"]
[38359,"H","Andre","Kobbe","BGC Wolfsburg","Ja","","","","",""]
[38374,"H","Philip","Kobbe","BGC Wolfsburg","Ja","26637","X","","",""]
[38595,"Sw 1","Marlies","Kobbe","BGC Wolfsburg","Ja","","","","",""]
[38596,"Sm 2","Wolfgang","Kobbe","BGC Wolfsburg","Ja","","","","",""]
[66641,"Jm","Patrick","Kober","MSC Bensheim-Auerbach e.V.","","","","","",""]
[66636,"Sw 1","Marion","Kober","MSC Bensheim-Auerbach e.V.","","","","","",""]
[21472,"Sm 1","Markus","Köberle","1. MGC Ladenburg e.V.","","","","","",""]
[27551,"Sm 1","Roman","Kobisch","1. MGC Mainz e.V.","","","","","",""]
[27565,"Sw 1","Alice","Kobisch","1. MGC Mainz e.V.","","","","","",""]
[45575,"Sm 1","Robert","Koböck","MGF Hammer e.V.","","","","","",""]
[47206,"Sm 1","Konrad","Koböck","MGF Hammer e.V.","","","","","",""]
[66490,"H","Kevin","Koch","VFB 21 Neugattersleben e. V.","","","","","",""]
[67381,"Schm","Dennis","Koch","BGSV Bad Homburg","","","","","",""]
[2404,"Sm 1","Olaf","Koch","MGF Steinbruch Kempten","","","","","",""]
[67380,"Sm 1","Rolf","Koch","BGSV Bad Homburg","","","","","",""]
[67375,"Sm 1","Jürgen","Koch","1.KGC Mönchengladbach e.V.","","","","","",""]
[52103,"Sm 1","Jens","Koch","BGC Kiel West e.V.","","","","","",""]
[43836,"Sw 1","Anja","Koch","MGC Brunsbüttel e.V.","","","","","",""]
[37984,"Sm 2","Peter","Koch","1. MGC Mannheim 1968 e.V.","","","","","",""]
[27674,"Sm 1","Klaus","Kocks","BGV Backumer Tal Herten e.V.","","","","","",""]
[3613,"Sm 2","Gerhard","Kofler","MGC Monrepos e.V.","","","","","",""]
[47324,"D","Simone","Kohfeld","MSC Bensheim-Auerbach e.V.","","","","","",""]
[35075,"H","Sven","Kohl","MGC Bad Soden-Salmünster","","","","","",""]
[35098,"Sm 2","Bernd","Kohler","SV 1890 e.V. Dreieichenhain, Abt. Bahnengolf","","","","","",""]
[66573,"Sm 1","Jürgen","Köhler","MTV Seesen","Ja","","","","",""]
[18496,"Sm 2","Ulrich","Köhler","BSV 86 München e.V.","","","","","",""]
[66064,"Jm","Lukas","Kohlhaas","1. MGC Mainz e.V.","","","","","",""]
[50852,"Sm 2","Michael","Kohlhage","SSC Attendorn e.V.","","","","","",""]
[49559,"Sm 1","Michael","Kohnke","BGC Schloß Paffendorf e.V.","","","","","",""]
[34583,"H","Gabriel","Kolb","BIG ASPERG e.V.","","","","","",""]
[4492,"Sm 2","Max","Koll","MC 62 Lüdenscheid e.V.","","","","","",""]
[36379,"Sw 2","Renate","Koll","MC 62 Lüdenscheid e.V.","","","","","",""]
[67137,"Sw 2","Jutta","Kolloff","MGC Peine","Ja","","","","",""]
[61900,"Sm 2","Johann","Komurka","1. MGC Ladenburg e.V.","","","","","",""]
[66181,"Sm 1","Bernd","Könemann","TSV Salzgitter","Ja","","","","",""]
[66182,"Sw 1","Nicole","Könemann","TSV Salzgitter","Ja","","","","",""]
[66968,"Jm","Joshua","Könen","MGC Bad Bodendorf e.V.","","","","","",""]
[66151,"H","Stephan","Konieczny","MSC Bensheim-Auerbach e.V.","","","","","",""]
[65818,"H","Kevin","König","1. Bahnengolf-Club Singen e.V.","","","","","",""]
[67027,"H","Rene","König","MGV Ansbach e.V.","","","","","",""]
[67119,"D","Jasmin","König","MGV Ansbach e.V.","","","","","",""]
[67109,"Schm","Lukas","König","MGV Ansbach e.V.","","","","","",""]
[36548,"Sm 1","Bert","König","1. Minigolf-Club Rheinhausen e.V.","","","","","",""]
[36549,"Sm 1","Frank","König","1. Minigolf-Club Rheinhausen e.V.","","","","","",""]
[36196,"Sw 1","Beate","König","1. Minigolf-Club Rheinhausen e.V.","","","","","",""]
[4539,"Sm 2","Wolfgang","König","1. MSC Hamburg-Neu Wulmstorf","","","","","",""]
[21380,"Sm 2","Helmut","König","VfM Bottrop e.V.","","","","","",""]
[66051,"Sm 2","Erich","König","SSC Attendorn e.V.","","","","","",""]
[6233,"Sw 2","Hannelore","König","1. MSC Hamburg-Neu Wulmstorf","","","","","",""]
[67057,"Sw 2","Irmtraud","König","MGC Heringen 1997 e.V.","","","","","",""]
[5696,"Sw 2","Ingeborg","Könnecke","MGF Ottobrunn e.V.","","","","","",""]
[66646,"Sm 1","Frank","Konschak","MGC Rot-Weiß Wanne-Eickel e.V.","","","","","",""]
[37380,"Sm 1","Alfred","Konstanzer","1. MGC Metzingen e.V.","","","","","",""]
[37506,"Sm 1","Günther","Konstanzer","1. MGC Hechingen","","","","","",""]
[66828,"Schm","Nils","Körner","TSV Pfungstadt Abt. Bahnengolf e.V.","","","","","",""]
[5842,"Sm 2","Dieter","Körner","MGC Monrepos e.V.","","","","","",""]
[61974,"Sm 2","Hans","Koslowski","BGC Celle","Ja","","","","",""]
[44601,"Sm 2","Helmut","Kosmowski","MGF Hilzingen 80 e.V.","","","","","",""]
[23976,"Sm 1","Klaus","Kossmann","MSK Neheim-Hüsten e.V.","","","","","",""]
[36868,"Sm 2","Mario","Kostack","MSG Kempten e.V.","","","","","",""]
[67152,"D","Sabine","Kottek","MGC Heven e.V.","","","","","",""]
[44870,"Sm 1","Martin","Köttel","ASV Pegnitz, Abt. Minigolf","","","","","",""]
[42073,"Sw 1","Manuela","Köttel","ASV Pegnitz, Abt. Minigolf","","","","","",""]
[67179,"Sm 1","Chris","Kougioumtzidis","MGC Rot-Weiß Wanne-Eickel e.V.","","","","","",""]
[44018,"D","Elke","Kowatsch","BGC Bad Berneck e.V.","","","","","",""]
[46426,"D","Tanja","Koziol","MGC Bad Hersfeld","","","","","",""]
[31769,"Sm 1","Michael","Koziol","BGS Hardenberg-Pötter e.V.","","","","","",""]
[5722,"Sm 2","Paul","Kraas","1. MGSV Netphen e.V.","","","","","",""]
[67077,"Sm 2","Herwart","Kraaz","MTV Seesen","Ja","","","","",""]
[25778,"Sw 2","Kristin","Kraft-Efinger","HMC Büttgen e.V.","","","","","",""]
[20342,"Sm 2","Norbert","Kramer","1. MGC Mainz e.V.","","","","","",""]
[38200,"H","Sebastian","Krämer","MSC Blau-Weiß 2003 München e.V.","","","","","",""]
[44705,"Sm 1","Mathias","Krämer","MSC Blau-Weiß 2003 München e.V.","","","","","",""]
[50644,"Sw 1","Bärbel","Krämer","MSC Blau-Weiß 2003 München e.V.","","","","","",""]
[38393,"D","Michaela","Krane","BGC Wolfsburg","Ja","28562","","","","X"]
[66222,"Jw","Melissa","Krane","MSK Neheim-Hüsten e.V.","","","","","",""]
[30374,"Sm 1","Jörg","Krane","MSK Neheim-Hüsten e.V.","","","","","",""]
[40222,"Sm 1","Ralf","Krane","MSK Neheim-Hüsten e.V.","","","","","",""]
[43336,"Sw 1","Bettina","Krane","MSK Neheim-Hüsten e.V.","","","","","",""]
[26070,"Sm 1","Stephan","Kraus","Bochumer Minigolf-Club 1960 e.V.","","","","","",""]
[67021,"H","Michel","Krause","Tempelhofer MV Berlin e.V.","","","","","",""]
[36157,"H","Dennis","Krause","MGC Millennium Lorsch e.V.","","","","","",""]
[48931,"Sm 1","Dirk","Krause","BGC Celle","Ja","20839","","X","","X"]
[24877,"Sm 2","Achim","Krause","BGC Dormagen e.V.","","","","","",""]
[66161,"Jm","Silvio","Krauss","1. MGC Mainz e.V.","","","","","",""]
[66160,"Jw","Selina","Krauss","1. MGC Mainz e.V.","","","","","",""]
[51058,"Sm 1","Michael","Krauß","MSV Bad Kreuznach","","","","","",""]
[66159,"Sw 1","Silvia","Krauss","1. MGC Mainz e.V.","","","","","",""]
[66158,"Sm 2","Siegfried","Krauss","1. MGC Mainz e.V.","","","","","",""]
[33755,"H","Philip","Krautheuser","1. Porzer MGC Grün-Weiß 1969 e.V.","","","","","",""]
[62949,"Sw 2","Hildegard","Krawutschke","Niendorfer MC","","","","","",""]
[957,"H","Christian","Krebs","MGC Göttingen","Ja","","","","",""]
[66917,"H","Tobias","Kreddig","BSC Ennepetal e.V.","","","","","",""]
[38546,"Sm 1","Günther","Kreisheimer","MGC \"Stahlquelle\" Bad Bocklet","","","","","",""]
[38545,"Sw 1","Antje","Kreisheimer","MGC \"Stahlquelle\" Bad Bocklet","","","","","",""]
[36641,"H","Rene","Kreitz","MGC Göttingen","Ja","","","","",""]
[66877,"Sm 2","Dieter","Kretschmer","Hamburger MC von 1965 e.V.","","","","","",""]
[34823,"Sm 2","Bernhard","Kreutter","MGF Waldshut 74 e.V.","","","","","",""]
[24111,"H","Tobias","Kreuzer","ASV Pegnitz, Abt. Minigolf","","","","","",""]
[30925,"H","Andreas","Kreuzer","ASV Pegnitz, Abt. Minigolf","","","","","",""]
[36156,"D","Tina","Kreuzer-Morgenstern","ASV Pegnitz, Abt. Minigolf","","","","","",""]
[42126,"Sm 2","Gerhard","Krickhahn","MGC Rot-Weiß Wanne-Eickel e.V.","","","","","",""]
[38453,"H","Thomas","Krieger","1. MGC München-Feldmoching e.V.","","","","","",""]
[67353,"D","Simone ","Krieger","HMC Büttgen e.V.","","","","","",""]
[67089,"Jm","Leon","Krieger","HMC Büttgen e.V.","","","","","",""]
[66265,"Sm 2","Wolfgang","Krieger","Minigolf Wölfe Rheinstetten 02","","","","","",""]
[33310,"Sm 2","Gerhard","Krieger","1. MGC München-Feldmoching e.V.","","","","","",""]
[35781,"Sm 2","Andreas","Krieger","BGSV Bad Homburg","","","","","",""]
[40965,"Sw 1","Susanne","Kritsch","BGC Hannover","Ja","16725","","X","",""]
[34432,"H","David-Alexander","Kröger","MSV Bad Münder/Springe","Ja","","","","",""]
[3168,"Sm 2","Erich","Kröger","MGC Brunsbüttel e.V.","","","","","",""]
[36528,"Sm 2","Wolfgang","Kröger","TSV Kücknitz Abt. Bahnengolf","","","","","",""]
[3116,"Sw 2","Maren","Kröger","MGC Brunsbüttel e.V.","","","","","",""]
[45122,"Sm 1","Gerd","Krohmer","MGF 77 Sickenhausen e.V.","","","","","",""]
[3365,"Sm 2","Johann","Kröll","1. Porzer MGC Grün-Weiß 1969 e.V.","","","","","",""]
[40017,"Sw 2","Helene","Kröll","1. Porzer MGC Grün-Weiß 1969 e.V.","","","","","",""]
[35332,"Sm 1","Manfred","Kronenberg","Minigolfclub Karlshagen e.V.","","","","","",""]
[66824,"D","Susann","Kronschnabl","1. Münchener MGC e.V.","","","","","",""]
[64901,"Schm","Florian","Kronschnabl","1. Münchener MGC e.V.","","","","","",""]
[36647,"Sm 1","Manfred","Kronschnabl","1. Münchener MGC e.V.","","","","","",""]
[67078,"Sm 1","Theo","Kronschnabl","BGC Illertissen e.V.","","","","","",""]
[17833,"Sm 2","Erwin","Kroßa","BV Sennestadt","","","","","",""]
[17986,"Sm 2","Dietger","Krost","BGC Wolfsburg","Ja","","","","",""]
[66558,"Sm 1","Bernhard","Krug","1. BGC Landshut e.V.","","","","","",""]
[17741,"Sm 2","Reinhard","Krüger","1. MSC Hamburg-Neu Wulmstorf","","","","","",""]
[35890,"Sm 2","Siegfried","Krüger","BGSC Bochum 1978 e.V.","","","","","",""]
[958,"H","Michael","Krull","MGC Göttingen","Ja","","","","",""]
[66657,"Sm 2","Karl-Heinz","Krull","MGC Göttingen","Ja","","","","",""]
[42429,"Sw 1","Patricia","Krumay","TSV Pfungstadt Abt. Bahnengolf e.V.","","","","","",""]
[36856,"Sm 1","Kai","Krumm","HMC Büttgen e.V.","","","","","",""]
[65839,"Sw 1","Melanie","Krumm","HMC Büttgen e.V.","","","","","",""]
[67169,"Sm 1","Klaus-Bernd","Kruse","MGC Millennium Lorsch e.V.","","","","","",""]
[46951,"Sm 1","Manuel","Kruse","BGC Northeim","Ja","","","","",""]
[47258,"Sm 1","André","Kruse","MGC Bad Salzuflen e.V.","","","","","",""]
[40300,"Sm 2","Manfred","Krusenbaum","VfM Bottrop e.V.","","","","","",""]
[50855,"Sw 1","Nicole","Krux","1. Porzer MGC Grün-Weiß 1969 e.V.","","","","","",""]
[67017,"H","Maurice","Krzyza","BGSC Bochum 1978 e.V.","","","","","",""]
[35655,"H","Sebastian","Kube","MGC Dormagen-Brechten e.V.","","","","","",""]
[65952,"H","Kai","Kübler","BGC Bad Mergentheim e.V.","","","","","",""]
[66045,"Sm 2","Manfred","Kubzda","MGV Bremen","Ja","","","","",""]
[66836,"Sw 2","Elke","Kubzda","MGV Bremen","Ja","","","","",""]
[37790,"H","Jannik","Kuchenbuch","1. MGC Mainz e.V.","","","","","",""]
[37693,"Sm 2","Helmut","Kühbauch","1. MGC Metzingen e.V.","","","","","",""]
[17549,"Sm 2","Dieter","Kuhl","Minigolfunion Neviges-Odenthal 1968 e.V.","","","","","",""]
[62879,"Sw 2","Magdalena","Kuhl","Minigolfunion Neviges-Odenthal 1968 e.V.","","","","","",""]
[29326,"Sm 1","Peter","Kuhlenberg","1. MGSV Netphen e.V.","","","","","",""]
[66350,"H","Giuseppe","Kühmstädt","BGSV Castrop e.V. 1961","","","","","",""]
[65929,"H","Dustin","Kuhn","MGV Spandau","","","","","",""]
[44146,"Sm 1","André","Kuhn","MGC Göttingen","Ja","","","","",""]
[66860,"Sm 1","Marco","Kühn","MGC Rot-Weiß Wanne-Eickel e.V.","","","","","",""]
[40132,"Sm 2","Ingo","Kuhnert","MGC Wertheim 91 e.V.","","","","","",""]
[45671,"H","Stefan","Küll","MGC Bad Salzuflen e.V.","","","","","",""]
[40126,"H","Christian","Kullick","Tempelhofer MV Berlin e.V.","","","","","",""]
[20595,"Sm 2","Robert","Kullick","Tempelhofer MV Berlin e.V.","","","","","",""]
[66042,"H","Ingo","Kullmann","MSV Bad Kreuznach","","","","","",""]
[44774,"Sm 2","Peter","Kulse","MGC Olympia Kiel e.V.","","","","","",""]
[21411,"Sm 1","Wolfgang","Kunert","1. MGC Bamberg e.V.","","","","","",""]
[38351,"Sm 2","Herbert","Kunimünch","BSV Inzlingen 1979 e.V.","","","","","",""]
[38352,"Sw 2","Monika","Kunimünch","BSV Inzlingen 1979 e.V.","","","","","",""]
[67316,"D","Jennifer","Kunisch","BGC Bad Mergentheim e.V.","","","","","",""]
[30336,"Sm 1","Jens-Michael","Künnecke","BGC Northeim","Ja","","","","",""]
[33425,"H","Marcel","Kunstmann","Elbhavelland e.V., Abt. Minigolfsport","","","","","",""]
[33427,"Sm 1","Andreas","Kunstmann","Elbhavelland e.V., Abt. Minigolfsport","","","","","",""]
[30521,"Sm 1","Markus","Kuntermann","KSV Baltrum e.V.","","","","","",""]
[38162,"Sm 1","Holger","Kuntz","1. MGC Saar 68 St. Ingbert e.V.","","","","","",""]
[66139,"D","Lisa","Kuntze","TSV Pfungstadt Abt. Bahnengolf e.V.","","","","","",""]
[66428,"Sm 1","Jürgen","Kuntze","TSV Pfungstadt Abt. Bahnengolf e.V.","","","","","",""]
[66977,"D","Simone","Kunz","MGC Kassel","Ja","","","","",""]
[66519,"Sm 1","Peter","Kunz","MGC Kassel","Ja","","","","",""]
[5225,"Sm 2","Bernd","Kunz","MGC Olympia Kiel e.V.","","","","","",""]
[25024,"Sw 2","Helga","Kunz","MGC Olympia Kiel e.V.","","","","","",""]
[6538,"Sm 2","Hans-Peter","Künzel","1. MGC Ludwigshafen e.V.","","","","","",""]
[66855,"H","Thorsten","Kurkowski","1. MGC Gelsenkirchen e.V.","","","","","",""]
[37998,"H","Patrick","Kurtz","BGSC Bochum 1978 e.V.","","","","","",""]
[38084,"Sm 2","Rainer","Kurtz","BGSC Bochum 1978 e.V.","","","","","",""]
[34665,"H","Jochen","Kurz","1. MGC Metzingen e.V.","","","","","",""]
[41007,"H","Mikael","Kurzweg","Bochumer Minigolf-Club 1960 e.V.","","","","","",""]
[66103,"H","Raphael","Kuschel","MGC Dormagen-Brechten e.V.","","","","","",""]
[23321,"Sm 2","Jürgen","Kuß","1. MGC Mannheim 1968 e.V.","","","","","",""]
[46027,"Sm 2","Bernd","Kussnereit","MGC Homburger Land e.V.","","","","","",""]
[5956,"Sm 2","Helmut","Kuttig","Minigolfunion Neviges-Odenthal 1968 e.V.","","","","","",""]
[25372,"Sm 2","Emil","Laber","BIG ASPERG e.V.","","","","","",""]
[25371,"Sw 2","Andrea","Laber","BIG ASPERG e.V.","","","","","",""]
[67363,"Schm","Daniele","Labita","BSV 86 München e.V.","","","","","",""]
[35816,"Sm 1","Gerald","Lachmayer","MGSC Wernau e.V.","","","","","",""]
[29677,"H","René","Lagerquist","MGC Olympia Kiel e.V.","","","","","",""]
[49742,"Sw 1","Britta","Lagerquist","MGC Olympia Kiel e.V.","","","","","",""]
[41848,"Sm 1","Stefan","Lahann","1. MSC Hamburg-Neu Wulmstorf","","","","","",""]
[5260,"Sm 2","Peter","Lais","1. Münchener MGC e.V.","","","","","",""]
[65072,"Sw 2","Cornelia","Lais","1. Münchener MGC e.V.","","","","","",""]
[29247,"Sm 1","Andreas","Lammers","VfM Bottrop e.V.","","","","","",""]
[30743,"H","Christian","Lampert","1. BGC Wesseling 1975 e.V.","","","","","",""]
[60472,"Sm 2","Herbert","Landefeld","BGC Hamm 1959 e.V.","","","","","",""]
[63347,"Sw 2","Regina","Landefeld","BGC Hamm 1959 e.V.","","","","","",""]
[6879,"Sm 2","Helmut","Landl","BSV 86 München e.V.","","","","","",""]
[31613,"Sw 2","Christa","Landl","BSV 86 München e.V.","","","","","",""]
[35806,"H","Martin","Lanfer","MGC Dormagen-Brechten e.V.","","","","","",""]
[30907,"H","Jürgen","Lang","1. MGC Mitterteich-Großbüchlberg","","","","","",""]
[64182,"D","Ramona","Lang","1. MGC Mitterteich-Großbüchlberg","","","","","",""]
[38064,"Jm","Timo","Lang","MSC Bad Godesberg e.V.","","","","","",""]
[46037,"Sm 1","Ewald","Lang","MSC Bad Godesberg e.V.","","","","","",""]
[34780,"Sm 1","Jürgen","Lang","1. MGC Süßen e.V.","","","","","",""]
[37857,"Sm 2","Michael","Lang","BGC Bildstock e.V.","","","","","",""]
[37204,"H","Phillipp","Lange","BGSV Castrop e.V. 1961","","","","","",""]
[879,"Jm","Kevin","Lange","BGC Diepholz","Ja","","","","",""]
[12503,"Sm 2","Dieter","Lange","MGC \"AS\" Witten 1963 e.V.","","","","","",""]
[17614,"Sm 2","Friedrich","Lange","1.KGC Mönchengladbach e.V.","","","","","",""]
[66415,"Sm 2","Wilfried","Lange","BGSV Castrop e.V. 1961","","","","","",""]
[17112,"Sw 2","Maria","Lange","MGC \"AS\" Witten 1963 e.V.","","","","","",""]
[17615,"Sw 2","Marlene","Lange","1.KGC Mönchengladbach e.V.","","","","","",""]
[66132,"Sm 2","Uwe","Langemann","SV Gebhardshagen","Ja","","","","",""]
[33485,"D","Bianca","Langenbacher","1. MGC Tuttlingen e.V.","","","","","",""]
[66570,"Jm","Yannick","Langer","MGC Ingolstadt e.V.","","","","","",""]
[67288,"Schm","Nick","Langer","MGC Kassel","Ja","","","","",""]
[29043,"Sm 1","Waldemar","Langer","1. BGC Landshut e.V.","","","","","",""]
[66571,"Sm 1","Viktor","Langer","MGC Ingolstadt e.V.","","","","","",""]
[35700,"Sm 1","Martin","Langfeld","1. MGC Metzingen e.V.","","","","","",""]
[34921,"Sm 2","Heinz","Langner","TSV 1848 Flöha","","","","","",""]
[902,"D","Janina","Laskowski","BGC Hannover","Ja","","","","",""]
[44812,"Sm 2","Günter","Lassen","MSC Herscheid 1963 e.V.","","","","","",""]
[50101,"D","Tanja","Lauber-Selka","MSK Neheim-Hüsten e.V.","","","","","",""]
[41392,"Sm 1","Holger","Lauble","MGF Waldshut 74 e.V.","","","","","",""]
[6368,"Sm 2","Ekkehard","Lauer","OMGC Ingolstadt e.V.","","","","","",""]
[66996,"Jm","Magnus","Lauf","MGF Magdeburg 1995 e.V.","","","","","",""]
[67322,"Sm 1","Gunter","Laurenz","Osnabrücker M.-C. von 1963 e.V.","","","","","",""]
[67321,"Sw 1","Anja","Laurenz","Osnabrücker M.-C. von 1963 e.V.","","","","","",""]
[66198,"Sm 2","Horst","Laurenz","MSG Kempten e.V.","","","","","",""]
[34469,"D","Aylin","Lauterfeld","TSV Pfungstadt Abt. Bahnengolf e.V.","","","","","",""]
[35659,"H","Marcel","Laux","MGC Traben-Trarbach","","","","","",""]
[33131,"Sm 1","Alexander","Laux","MGC Traben-Trarbach","","","","","",""]
[38368,"D","Galina","Lebedeva","MGF Ottobrunn e.V.","","","","","",""]
[47498,"Sw 1","Ilona","Lechler","MGC Schwaikheim e.V.","","","","","",""]
[67187,"Schm","Justin","Lechtenfeld","MGC Rot-Weiß Wanne-Eickel e.V.","","","","","",""]
[64869,"H","Hans-Josef","Lefkes","BGC Uerdingen e.V.","","","","","",""]
[48696,"Sm 1","Valentino","Legisa","BGSC \"Gut Schlag\" Gladbeck e.V.","","","","","",""]
[67372,"H","Niclas","Lehmann","SC Olympia Dortmund e.V.","","","","","",""]
[66356,"Sm 2","Reiner","Lehmann","MGC \"Stahlquelle\" Bad Bocklet","","","","","",""]
[23055,"Sm 2","Detlef","Lehmann","Bochumer Minigolf-Club 1960 e.V.","","","","","",""]
[32627,"H","Kevin","Leickel","MGC Olympia Kiel e.V.","","","","","",""]
[35756,"Sm 1","Andreas","Leidlein","1. MGC Gelsenkirchen e.V.","","","","","",""]
[66327,"Sm 2","Adam","Leist","Minigolf Wölfe Rheinstetten 02","","","","","",""]
[41235,"Sm 1","Hans","Lemanczyk","1. MSC Hamburg-Neu Wulmstorf","","","","","",""]
[62202,"Sm 2","Dieter","Lemanczyk","1. MSC Hamburg-Neu Wulmstorf","","","","","",""]
[29671,"H","André","Lemke","MGC Olympia Kiel e.V.","","","","","",""]
[34585,"D","Sabrina","Lemke","MGC Olympia Kiel e.V.","","","","","",""]
[67207,"Sm 1","Thomas ","Lemke","Kölner Miniatur Golf Club e.V.","","","","","",""]
[28673,"Sm 1","Kai","Lemke","MGC Olympia Kiel e.V.","","","","","",""]
[41266,"Sw 1","Cornelia","Lemke","MGC Olympia Kiel e.V.","","","","","",""]
[44385,"Sm 1","Andreas","Lemm","MGC Freizeitzentrum Biebertal","","","","","",""]
[67390,"Sm 1","Georg","Lemm","Kölner Miniatur Golf Club e.V.","","","","","",""]
[36891,"D","Anglique","Lempenauer","MGF Steinbruch Kempten","","","","","",""]
[67220,"Sm 2","Georg","Lendzian","SC Olympia Dortmund e.V.","","","","","",""]
[66434,"H","Markus","Lenertz","MSC Herscheid 1963 e.V.","","","","","",""]
[29795,"D","Katharina","Lenertz","MSC Herscheid 1963 e.V.","","","","","",""]
[38613,"H","Andre","Lenger","MGC Bad Salzuflen e.V.","","","","","",""]
[61716,"Sm 2","Rolf","Lenk","MGC \"AS\" Witten 1963 e.V.","","","","","",""]
[26539,"Sm 1","Axel","Lenz","MGF Hilzingen 80 e.V.","","","","","",""]
[38115,"Sm 2","Jürgen","Lenz","HMC Büttgen e.V.","","","","","",""]
[38038,"Sw 2","Susanne","Lenz-Fregin","PTSV Hof, Abt. Minigolf ","","","","","",""]
[67315,"Sm 2","Heinz Peter","Leonhardt","MGC Bad Homburg vdH e.V.","","","","","",""]
[36564,"H","Björn","Lepa","TSV Salzgitter","Ja","","","","",""]
[35504,"H","Gerrit","Lerch","MC Ilvesheim e.V.","","","","","",""]
[34317,"Sm 1","Oliver","Lerch","BGSV Bad Homburg","","","","","",""]
[66401,"Sm 1","Jörg","Leske","Tempelhofer MV Berlin e.V.","","","","","",""]
[5776,"Sw 2","Irena","Lesnik","SSV Ulm 1846 Abt. Bahnengolf","","","","","",""]
[33676,"Sm 2","Erich","Less","BGC Schweinfurt e.V.","","","","","",""]
[40048,"Sm 1","Michael","Leßner","Bochumer Minigolf-Club 1960 e.V.","","","","","",""]
[30039,"Sm 1","Reinhard","Letzel","BGC Rheinau-Freistett e.V.","","","","","",""]
[3756,"Sm 2","Hans-Winfried","Leuchtenberger","VfM e.V. Berlin ","","","","","",""]
[4072,"Sw 2","Sigrid","Leuchtenberger","VfM e.V. Berlin ","","","","","",""]
[51324,"H","Marcus","Leuthäußer","MGV Bremen","Ja","21737","","","","X"]
[36908,"H","Philipp","Lewin","MSK Neheim-Hüsten e.V.","","","","","",""]
[66907,"Sw 2","Karin","Leyer","SV 1890 e.V. Dreieichenhain, Abt. Bahnengolf","","","","","",""]
[66351,"Sw 1","Heike","Liberoudis","BGC Bremen","Ja","","","","",""]
[37633,"H","Jan Peter","Lichtenberg","1. KC Homburg-Saar 1967 e.V.","","","","","",""]
[23239,"Sm 2","Kurt","Lichtenberg","BSV 82 Ohlsbach e.V.","","","","","",""]
[65975,"Sm 2","Hans-Jürgen","Lichterfeld","MGC Bergisch Gladbach Gierath e.V.","","","","","",""]
[65873,"H","Johannes","Lieber","1. KC Homburg-Saar 1967 e.V.","","","","","",""]
[23980,"Sm 2","Bernhard","Liebetrau","Miniaturgolf Sportclub Schriesheim e.V","","","","","",""]
[48671,"H","Sven","Liebig","BGC Hannover","Ja","","","","",""]
[67157,"D","Diana","Liebig","BGC Hannover","Ja","","","","",""]
[67158,"Schm","Jan ","Liebig","BGC Hannover","Ja","","","","",""]
[30138,"Sm 1","Axel","Liebig","SSC Attendorn e.V.","","","","","",""]
[42408,"Sm 2","Manfred","Liebstückel","MGC Wertheim 91 e.V.","","","","","",""]
[42417,"Sw 2","Ruth","Liebstückel","MGC Wertheim 91 e.V.","","","","","",""]
[27921,"Sm 2","Peter","Liedhegener","MSK Neheim-Hüsten e.V.","","","","","",""]
[65928,"H","Tobias","Limbacher","TV Niederstetten 1862 e.V.  Abt. Minigolf","","","","","",""]
[44172,"H","Matthias","Limpius","TG Höchberg von 1862 Bahnengolf e.V.","","","","","",""]
[66148,"D","Simone","Limpius","TG Höchberg von 1862 Bahnengolf e.V.","","","","","",""]
[42074,"Sw 1","Andrea","Limpius","TG Höchberg von 1862 Bahnengolf e.V.","","","","","",""]
[5966,"Sm 2","Werner","Limpius","TG Höchberg von 1862 Bahnengolf e.V.","","","","","",""]
[36091,"Sm 2","Alfred","Lindauer","OMGC Ingolstadt e.V.","","","","","",""]
[25107,"Sm 2","Jürgen","Linde","SSC Attendorn e.V.","","","","","",""]
[66253,"Jm","Lukas","Lindemann","BGSV Bad Homburg","","","","","",""]
[66254,"Sm 1","Oliver","Lindemann","BGSV Bad Homburg","","","","","",""]
[40203,"D","Mareike","Lindenberg","BGC Celle","Ja","","","","",""]
[9959,"Sm 1","Fritz","Lindner","ASV Pegnitz, Abt. Minigolf","","","","","",""]
[40475,"Sm 1","Bernhard","Lindner","1. NMC Kelheim e.V.","","","","","",""]
[41825,"Sm 2","Gisbert","Lindner","BGC Neutraubling e.V.","","","","","",""]
[37136,"D","Sarah","Lingemann","VfB Osnabrück e.V.","","","","","",""]
[66396,"Schw","Christin","Lingemann","Osnabrücker M.-C. von 1963 e.V.","","","","","",""]
[48947,"Sm 1","Konrad","Lingemann","Osnabrücker M.-C. von 1963 e.V.","","","","","",""]
[65182,"Sw 1","Betina","Linke","1. Bahnengolf-Club Singen e.V.","","","","","",""]
[37973,"Sm 2","Horst","Linke","1. Bahnengolf-Club Singen e.V.","","","","","",""]
[37415,"D","Christina","Linke-König","1. Bahnengolf-Club Singen e.V.","","","","","",""]
[66747,"Jm","Matti","Linker","CGC Rauschenberg e.V.","","","","","",""]
[63137,"Sm 2","Manfred","Lippert","MSV Bad Kreuznach","","","","","",""]
[33730,"H","Martin","Lischke","OMGC Ingolstadt e.V.","","","","","",""]
[65442,"D","Brigitte","Lischke","OMGC Ingolstadt e.V.","","","","","",""]
[36053,"Sw 2","Ingeborg","Littmann","MGS Hildesheim","Ja","","","","",""]
[29299,"Sm 2","Heinz","Löbel","OMGC Ingolstadt e.V.","","","","","",""]
[36844,"Sm 2","Gerhard","Lödige","1. MGC Paderborn e.V.","","","","","",""]
[36853,"Sw 2","Maria","Lödige","1. MGC Paderborn e.V.","","","","","",""]
[6464,"Sm 2","Manfred","Loewe","BSC Ennepetal e.V.","","","","","",""]
[41993,"Sm 1","Volker","Loferski","MGC Lippe-Detmold e.V.","","","","","",""]
[66736,"Sm 2","Harry","Löffler","1. BGC Landshut e.V.","","","","","",""]
[30914,"Sm 2","Alfred","Lohe","BGSC \"Gut Schlag\" Gladbeck e.V.","","","","","",""]
[36543,"Sw 2","Angelika","Lohe","BGSC \"Gut Schlag\" Gladbeck e.V.","","","","","",""]
[36001,"H","Christian","Lohmann","BGC Hamm 1959 e.V.","","","","","",""]
[36000,"Sm 2","Udo","Lohmann","BGC Hamm 1959 e.V.","","","","","",""]
[36678,"Sw 2","Helga","Lohmann","BGC Hamm 1959 e.V.","","","","","",""]
[66289,"Jw","Milene-Marie","Lohmeyer","BGV Backumer Tal Herten e.V.","","","","","",""]
[66770,"D","Liane","Lohn","MGC Rot-Weiß Wanne-Eickel e.V.","","","","","",""]
[66688,"Jm","Fabian","Lohn","1. MSC Wesel 6.6.1966 e.V.","","","","","",""]
[47063,"Sm 1","Thomas","Lohöfener","BV Sennestadt","","","","","",""]
[45633,"Sm 2","Michael","Löhr","BGSC Bochum 1978 e.V.","","","","","",""]
[49463,"Sw 2","Elke","Löhr","BGSC Bochum 1978 e.V.","","","","","",""]
[4788,"Sm 2","Roland","Löhrlein","1. FMGC Lichtenfels 1961 e.V.","","","","","",""]
[66834,"H","Martin","Loibl","1. Berliner Miniaturgolf-Sportclub e.V. 1960","","","","","",""]
[33631,"H","Thomas","Lojewski","MGC Murnau am Staffelsee e.V.","","","","","",""]
[66958,"Sm 1","Peter","Lorch","1. MGC Mainz e.V.","","","","","",""]
[35306,"H","Patrick","Lorenz","SG Arheilgen Abt. Bahnengolf","","","","","",""]
[33781,"Sm 2","Hermann","Lorenz","MGC Wetzlar e.V.","","","","","",""]
[33338,"Sm 2","Uwe","Lorenz","MC Möve Cuxhaven","Ja","","","","",""]
[33862,"Sw 2","Sigrid Anni","Lorenz","MGC Wetzlar e.V.","","","","","",""]
[46048,"D","Melanie","Lorgie","MGC Olympia Kiel e.V.","","","","","",""]
[5852,"Sm 2","Hans-Herbert","Lorgie","MGC Olympia Kiel e.V.","","","","","",""]
[41253,"Sw 2","Regina","Lorgie","MGC Olympia Kiel e.V.","","","","","",""]
[27300,"Sm 1","Thomas","Losch","BGC Hannover","Ja","","","","",""]
[36171,"H","Dennis","Löschmann","Tempelhofer MV Berlin e.V.","","","","","",""]
[34157,"Sm 1","Michael","Lotz","MGC Bad Soden-Salmünster","","","","","",""]
[66395,"Sm 1","Hans","Louven","MC Georgsmarienhütte e.V.","","","","","",""]
[5594,"Sm 2","Herbert","Löwer","MGC Kassel","Ja","","","","",""]
[60488,"Sw 2","Eva","Löwer","MGC Kassel","Ja","","","","",""]
[45994,"Sw 1","Bettina","Luckei","MGC Lohfelden","Ja","","","","",""]
[45995,"Sm 2","Manfred","Luckei","MGC Lohfelden","Ja","","","","",""]
[67406,"D","Carmen Ariane","Luczyk","BV Sennestadt","","","","","",""]
[37293,"H","Dominik","Ludwig","BGC Goslar","Ja","","","","",""]
[37295,"H","Sven","Ludwig","BGC Goslar","Ja","","","","",""]
[1501,"Sw 1","Kornelia","Ludwig","BGC Goslar","Ja","","","","",""]
[67373,"H","Niklas","Ludzay","SC Olympia Dortmund e.V.","","","","","",""]
[41227,"Sm 1","Robert","Lugauer","MGC Ingolstadt e.V.","","","","","",""]
[3261,"Sm 2","Werner","Lührs","VfL Lüneburg","Ja","","","","",""]
[33613,"H","Marcel","Lukat","MGC Brunsbüttel e.V.","","","","","",""]
[40720,"Sm 1","Dirk","Lumma","HMC Büttgen e.V.","","","","","",""]
[5586,"Sm 2","Horst","Luther","MGC Ostheim / Rhön e.V.","","","","","",""]
[21946,"Sm 2","Winfried","Lüttenberg","1. Essener CGC \"Blau-Gold\" e.V.","","","","","",""]
[38641,"Sm 2","Herbert","Luttmann","VfB Osnabrück e.V.","","","","","",""]
[22917,"Sm 1","Hugo","Lutz","1. Bahnengolf-Club Singen e.V.","","","","","",""]
[40232,"Sm 2","Helmut","Lutz","SSC Attendorn e.V.","","","","","",""]
[22913,"Sw 2","Martina","Lutz","1. Bahnengolf-Club Singen e.V.","","","","","",""]
[45123,"Sw 2","Angelika","Luz","1. MGC Metzingen e.V.","","","","","",""]
[34902,"H","Daniel","Maar","BGSV Castrop e.V. 1961","","","","","",""]
[66036,"D","Vanessa","Maaß","MGC Brunsbüttel e.V.","","","","","",""]
[43837,"Sm 1","Herbert","Maaß","MGC Brunsbüttel e.V.","","","","","",""]
[43835,"Sw 1","Bettina","Maaß","MGC Brunsbüttel e.V.","","","","","",""]
[67167,"Sm 1","Stefan","Maes","BGS Hardenberg-Pötter e.V.","","","","","",""]
[38127,"Sm 2","Friedel","Maesel","MC 62 Lüdenscheid e.V.","","","","","",""]
[66970,"H","Omar","Maggi","SG Arheilgen Abt. Bahnengolf","","","","","",""]
[30185,"Sm 1","Thomas","Magin","1. MGC Ludwigshafen e.V.","","","","","",""]
[67278,"H","Simon","Mahl","1. BGC Garmisch-Partenkirchen","","","","","",""]
[49672,"Sm 2","Josef","Mahl","1. BGC Garmisch-Partenkirchen","","","","","",""]
[67194,"Schw","Lina","Mahnkopf","BGC Bremen","Ja","","","","",""]
[47032,"Sm 1","Josef","Maier","MGC Wolnzach e.V.","","","","","",""]
[66822,"Sm 1","Volker","Maier","MGF Ottobrunn e.V.","","","","","",""]
[36823,"Sm 1","Niklas","Maier","MGC Unterschneidheim e.V.","","","","","",""]
[66568,"Sw 1","Elke","Maier","1. Münchener MGC e.V.","","","","","",""]
[66497,"H","Anton","Maierhofer","MGF Ottobrunn e.V.","","","","","",""]
[66943,"D","Sandra","Mainka","MGC Kassel","Ja","","","","",""]
[67044,"H","Thomas","Maisch","MGC Monrepos e.V.","","","","","",""]
[67043,"D","Ramona","Maisch","MGC Monrepos e.V.","","","","","",""]
[37360,"Sm 1","Frank","Maldei","BGSC \"Gut Schlag\" Gladbeck e.V.","","","","","",""]
[49850,"Sm 1","Ralf","Malirs","SV Lurup Abt. Bahnengolf","","","","","",""]
[37865,"Sm 1","Joachim","Mally","SV 1890 e.V. Dreieichenhain, Abt. Bahnengolf","","","","","",""]
[25785,"Sm 1","Norman","Mandel","HMC Büttgen e.V.","","","","","",""]
[35634,"D","Manuela","Manderscheid","VfB Limbach 2000 e.V.","","","","","",""]
[50926,"Sm 1","Frank","Manderscheid","1. MGC Ludwigshafen e.V.","","","","","",""]
[6693,"Sm 2","Hans","Manderscheid","Freizeit Club Bliesen e.V.","","","","","",""]
[4846,"Sw 2","Marianne","Manderscheid","VfB Limbach 2000 e.V.","","","","","",""]
[3796,"Sm 2","Hans-Joachim","Mann","MGC Murnau am Staffelsee e.V.","","","","","",""]
[38500,"Sm 1","Stefan","Manthey","MSC Bad Godesberg e.V.","","","","","",""]
[67046,"Schm","Tim","Manz","VfM e.V. Berlin ","","","","","",""]
[40944,"Sw 1","Susanne","Manz","BGC Illertissen e.V.","","","","","",""]
[45029,"Sm 2","Wolfgang","Manz","BGC Illertissen e.V.","","","","","",""]
[4967,"Sm 2","Udo","Manz","1. MGC Mannheim 1968 e.V.","","","","","",""]
[67386,"Sm 1","Andreas","Marggraf","MGC Bad Salzuflen e.V.","","","","","",""]
[42687,"Sm 1","Christian","Marinello","MC Möve Cuxhaven","Ja","","","","",""]
[25593,"H","Sascha","Mark","1. Bahnengolf-Club Singen e.V.","","","","","",""]
[65657,"Sm 2","Max","Märkl","BGC Neutraubling e.V.","","","","","",""]
[45267,"Sm 1","Leif","Markmann","MGC Olympia Kiel e.V.","","","","","",""]
[50930,"Sm 2","Jürgen","Marschall","Freizeit Club Bliesen e.V.","","","","","",""]
[33471,"Sm 2","Heinz","Marterer","1. BGC Garmisch-Partenkirchen","","","","","",""]
[42045,"Sw 1","Sabine","Marterer-Schleser","1. MGC München-Feldmoching e.V.","","","","","",""]
[66957,"Sm 2","Christian","Marth","1. MGC Mainz e.V.","","","","","",""]
[35692,"Sw 1","Bärbel","Martin","MGC Olympia Kiel e.V.","","","","","",""]
[36222,"Sm 1","Sven","Martinez Moreno","1. Minigolf-Club Rheinhausen e.V.","","","","","",""]
[47173,"H","Ingo","Marx","1. MSC Hamburg-Neu Wulmstorf","","","","","",""]
[38469,"H","Eric","Marzian","Minigolfclub Karlshagen e.V.","","","","","",""]
[67365,"Sm 2","Claus","Maschauer","MGC Bad Homburg vdH e.V.","","","","","",""]
[67364,"Sw 2","Diana","Maschauer","MGC Bad Homburg vdH e.V.","","","","","",""]
[40718,"Sm 1","Jürgen","Maschotta","Minigolfunion Neviges-Odenthal 1968 e.V.","","","","","",""]
[40721,"Sm 1","Dirk","Maschotta","Minigolfunion Neviges-Odenthal 1968 e.V.","","","","","",""]
[33685,"Sm 2","Karl","Matejka","MGC Wertheim 91 e.V.","","","","","",""]
[6331,"Sm 2","Peter","Matern","1. MC Weinheim e.V.","","","","","",""]
[36982,"Sm 2","Friedhelm","Matern","MSC Bensheim-Auerbach e.V.","","","","","",""]
[42640,"Sm 2","Erwin","Materne","1. BGC Bad Füssing e.V.","","","","","",""]
[37435,"H","Alexander","Mathes","MGC \"Stahlquelle\" Bad Bocklet","","","","","",""]
[66724,"Schm","Nico","Mathes","MGC \"Stahlquelle\" Bad Bocklet","","","","","",""]
[67064,"Schw","Lena","Mathes","MGC \"Stahlquelle\" Bad Bocklet","","","","","",""]
[64161,"Sm 1","Bernd","Matthä","MGC Ostheim / Rhön e.V.","","","","","",""]
[38151,"H","David","Matthäi","BG Pfullingen","","","","","",""]
[65804,"Sm 2","Bernd","Matthies","MGC \"AS\" Witten 1963 e.V.","","","","","",""]
[65803,"Sw 2","Angelika","Matthies","MGC \"AS\" Witten 1963 e.V.","","","","","",""]
[28038,"Sm 1","Ralf","Mätz","BGC Rheinau-Freistett e.V.","","","","","",""]
[35865,"H","Dennis","Mau","1. Minigolf-Club Rheinhausen e.V.","","","","","",""]
[66874,"Schm","Felix","Mau","MGC Bad Homburg vdH e.V.","","","","","",""]
[66875,"Schm","Bastian","Mau","MGC Bad Homburg vdH e.V.","","","","","",""]
[48353,"Sm 1","Jürgen","Mau","1. Minigolf-Club Rheinhausen e.V.","","","","","",""]
[6782,"Sm 2","Ernst","Mauél","1. MGC Mainz e.V.","","","","","",""]
[38580,"H","Raik","Mauersberger","MGF Magdeburg 1995 e.V.","","","","","",""]
[66039,"Jm","Moritz","Maul","SG Arheilgen Abt. Bahnengolf","","","","","",""]
[34481,"Sm 1","Claus","Maurer","1. MGC Mannheim 1968 e.V.","","","","","",""]
[5100,"Sm 2","Franz","Maurer","1. MGC Ludwigshafen e.V.","","","","","",""]
[37831,"Sm 1","Christian","Mauser","TSV Arendsee e.V.","","","","","",""]
[66699,"Sw 2","Roswitha","Maute","1. MGC Hechingen","","","","","",""]
[42368,"Sm 1","Bernd","May","1. MGC Ladenburg e.V.","","","","","",""]
[66848,"Sm 1","Max","Mayer","1. CGC Blau-Gelb Grötzingen","","","","","",""]
[45271,"Sm 1","Gerd","Mayerhofer","1. MGC Süßen e.V.","","","","","",""]
[9823,"Sm 2","Herbert","Mazzoli","1. MGC Köln 1961 e.V.","","","","","",""]
[67253,"H","Marlon","Medding","MGV Spandau","","","","","",""]
[67254,"D","Janine","Medding","MGV Spandau","","","","","",""]
[50149,"H","Marco","Meffert","MGC Dormagen-Brechten e.V.","","","","","",""]
[66216,"Jm","Christopher","Mehl","MC Ilvesheim e.V.","","","","","",""]
[66329,"Sm 1","Tino","Mehlhorn","Kölner Miniatur Golf Club e.V.","","","","","",""]
[40719,"Sm 1","Achim","Meier","Minigolfunion Neviges-Odenthal 1968 e.V.","","","","","",""]
[38562,"Sw 1","Marianne","Meier","MGC Unterschneidheim e.V.","","","","","",""]
[17103,"Sm 2","Uwe","Meier","BGSV Kerpen e.V.","","","","","",""]
[36229,"Sm 2","Manfred","Meier","BGC Kiel West e.V.","","","","","",""]
[47267,"Sm 2","Ralf","Meierkord","MGC Bad Salzuflen e.V.","","","","","",""]
[66188,"H","Lars","Meißner","MGC Wetzlar e.V.","","","","","",""]
[61096,"Sm 2","Manfred","Meißner","MGC Peine","Ja","","","","",""]
[36232,"Sw 2","Hiltraut","Meissner","MC Flora Elmshorn e.V.","","","","","",""]
[31912,"H","Markus","Meister","1. MGC Ludwigshafen e.V.","","","","","",""]
[50463,"Sm 2","Hans-Peter","Meister","1. MGC Ludwigshafen e.V.","","","","","",""]
[29300,"Sm 2","Werner","Meixner","MGF Hammer e.V.","","","","","",""]
[66823,"Sw 1","Desirée","Mende","MGF Ottobrunn e.V.","","","","","",""]
[66705,"Sm 2","Günter","Mendyk","MGC Dortmund Syburg e.V.","","","","","",""]
[1077,"H","Patrick","Menzel","TSV Salzgitter","Ja","","","","",""]
[36022,"D","Melanie","Menzel","1. Essener CGC \"Blau-Gold\" e.V.","","","","","",""]
[6066,"Sm 2","Harald","Menzel","1. Minigolf-Club Rheinhausen e.V.","","","","","",""]
[9558,"Sm 2","Bernhard","Merges","MSV Bad Kreuznach","","","","","",""]
[66483,"Sw 2","Karin","Merkens","BGSV Castrop e.V. 1961","","","","","",""]
[45439,"Sm 1","Carsten","Mertens","1.KGC Mönchengladbach e.V.","","","","","",""]
[35707,"Sm 2","Karl-Heinz","Mertsch","MGC Kassel","Ja","","","","",""]
[33679,"Sm 1","Peter","Merz","BGC Schweinfurt e.V.","","","","","",""]
[37881,"Sm 1","Claus","Methner","1. MGC Metzingen e.V.","","","","","",""]
[35351,"Sm 1","Marc","Mette","1. MGC Gelsenkirchen e.V.","","","","","",""]
[50336,"Sm 1","Marcus","Mettler","MCE Sindelfingen e.V.","","","","","",""]
[36983,"H","Marc","Metz","MGC Bad Homburg vdH e.V.","","","","","",""]
[67085,"H","Michael","Meyer","1. Minigolf-Club Rheinhausen e.V.","","","","","",""]
[24684,"D","Monique","Meyer","BGV Backumer Tal Herten e.V.","","","","","",""]
[67298,"D","Britta","Meyer","KSV Baltrum e.V.","","","","","",""]
[37700,"Jm","Marcus","Meyer","MCE Sindelfingen e.V.","","","","","",""]
[37065,"Sm 1","Matthias","Meyer","MSV Bad Münder/Springe","Ja","","","","",""]
[29486,"Sm 1","Josef","Meyer","BGC Dormagen e.V.","","","","","",""]
[41492,"Sm 1","Klaus","Meyer","MSC Bad Godesberg e.V.","","","","","",""]
[29467,"Sm 1","Werner","Meyer","MCE Sindelfingen e.V.","","","","","",""]
[66816,"Sw 1","Marita","Meyer","MGV Bremen","Ja","","","","",""]
[66505,"Sw 1","Bettina","Meyer","MCE Sindelfingen e.V.","","","","","",""]
[37944,"Sm 2","Dieter","Meyer","SV Lurup Abt. Bahnengolf","","","","","",""]
[67117,"Sm 2","Werner","Meyer","SG Arheilgen Abt. Bahnengolf","","","","","",""]
[36748,"Sm 2","Rolf","Meyer","VfM Bottrop e.V.","","","","","",""]
[65621,"Sw 2","Christa","Meyer","1. BGC Paderborn e.V.","","","","","",""]
[67403,"H","Miroslaw","Michalski","MGC Dormagen-Brechten e.V.","","","","","",""]
[66389,"H","Nils","Michel","1. MSC Wesel 6.6.1966 e.V.","","","","","",""]
[33682,"Sm 1","Ralf","Michel","MGC Wertheim 91 e.V.","","","","","",""]
[64086,"Sm 2","Adolf","Michel","BGC Schweinfurt e.V.","","","","","",""]
[66899,"Sm 2","Roland","Michel","1. MSC Wesel 6.6.1966 e.V.","","","","","",""]
[41683,"Sw 1","Claudia","Michenfelder","BIG ASPERG e.V.","","","","","",""]
[33336,"Sm 2","Wolfgang","Michna","MC Möve Cuxhaven","Ja","","","","",""]
[33337,"Sw 2","Sigrid","Michna","MC Möve Cuxhaven","Ja","","","","",""]
[67307,"Sm 1","Horst","Miebach","MGC Nümbrecht e.V.","","","","","",""]
[30858,"Sm 1","Jörg","Mielenz","BGV Bergisch Land 1962 / 63 e.V.","","","","","",""]
[30714,"H","Frederick","Mießner","MGC Murnau am Staffelsee e.V.","","","","","",""]
[67257,"Sm 1","Frank","Milbers","1. MGC Mannheim 1968 e.V.","","","","","",""]
[67266,"Sw 1","Monika","Milbers","1. MGC Mannheim 1968 e.V.","","","","","",""]
[8613,"Sm 2","Klaus","Mildenberger","1. CGC Blau-Gelb Grötzingen","","","","","",""]
[65828,"H","Maximilian","Millhoff","SSC Attendorn e.V.","","","","","",""]
[42588,"Sm 1","Andreas","Minuth","BGC Wolfsburg","Ja","","","","",""]
[4621,"Sm 2","Karl-Heinz","Minuth","BGC Wolfsburg","Ja","","","","",""]
[4622,"Sw 2","Hanna","Minuth","BGC Wolfsburg","Ja","","","","",""]
[25538,"Sm 1","Volker","Missonnier","1. MGC Mainz e.V.","","","","","",""]
[28918,"Sm 1","Udo","Mitscher","MGC Traben-Trarbach","","","","","",""]
[38040,"Sm 1","Frank","Mitschke","SSC Halver e.V.","","","","","",""]
[36005,"Sw 1","Claudia","Mitschke","MGC Bad Salzuflen e.V.","","","","","",""]
[38539,"H","Stefan","Mittelhammer","1. MC Weinheim e.V.","","","","","",""]
[66976,"D","Nadja","Mittelhammer","1. MC Weinheim e.V.","","","","","",""]
[27214,"Sm 1","Norbert","Mitterle","TG Höchberg von 1862 Bahnengolf e.V.","","","","","",""]
[35154,"Sm 2","Alfred","Mix","BSV 86 München e.V.","","","","","",""]
[50242,"Sm 1","Joachim","Möbis","BGSV Castrop e.V. 1961","","","","","",""]
[38090,"Sm 1","Lothar","Möbs","MGC Ingolstadt e.V.","","","","","",""]
[38091,"Sw 1","Christine","Möbs","MGC Ingolstadt e.V.","","","","","",""]
[22203,"Sm 2","Rüdiger","Möck","MGC Millennium Lorsch e.V.","","","","","",""]
[34386,"D","Jasmin","Möckel","MGC Bad Soden-Salmünster","","","","","",""]
[33787,"Sm 2","Jürgen","Möckel","MGC Bad Soden-Salmünster","","","","","",""]
[33788,"Sw 2","Jutta","Möckel","MGC Bad Soden-Salmünster","","","","","",""]
[38152,"H","Manuel","Möhler","MGC Schwaikheim e.V.","","","","","",""]
[65870,"Jm","Julian","Möhler","MGC Schwaikheim e.V.","","","","","",""]
[38376,"Sm 1","Bernd","Möhler","TV Niederstetten 1862 e.V.  Abt. Minigolf","","","","","",""]
[49769,"H","Wilfried","Mohr","SC Gut Heil Neumünster e.V.","","","","","",""]
[40845,"Sm 2","Jakob","Mois","MGC Murnau am Staffelsee e.V.","","","","","",""]
[67231,"D","Michelle","Moldenhauer","BGC Oberhausen e.V.","","","","","",""]
[30348,"Sm 1","Maik","Moll","1. CGC Blau-Gelb Grötzingen","","","","","",""]
[5649,"Sw 2","Heidi","Moll","CGC Rauschenberg e.V.","","","","","",""]
[37921,"H","David","Möller","MSK Olching e.V.","","","","","",""]
[33192,"H","Markus","Möller","VfB Osnabrück e.V.","","","","","",""]
[17358,"Sm 2","Egon","Möller","BGC Bad Berneck e.V.","","","","","",""]
[3551,"Sm 2","Friedrich-Wilhelm","Möller","BGC Diepholz","Ja","","","","",""]
[17359,"Sm 2","Wolfgang","Möller","MGC Brunsbüttel e.V.","","","","","",""]
[37430,"H","Karel jr.","Molnár","BGS Hardenberg-Pötter e.V.","","","","","",""]
[31014,"Sw 1","Marion","Mombauer","BGC Uerdingen e.V.","","","","","",""]
[67202,"Schm","Felix Leon","Mönnig","CGC Rauschenberg e.V.","","","","","",""]
[26414,"Sm 1","Richard","Mönning","1. MGC Epe 1978 e.V.","","","","","",""]
[38208,"H","Tobias","Montberg","1. MSC Wesel 6.6.1966 e.V.","","","","","",""]
[36103,"Sm 1","Michael","Montes","MSK Neheim-Hüsten e.V.","","","","","",""]
[12100,"Sm 2","Hans","Mordhorst","VfM e.V. Berlin ","","","","","",""]
[17884,"Sw 2","Rosemarie","Mordhorst","VfM e.V. Berlin ","","","","","",""]
[67348,"Sm 1","Ruggiero","Morelli","1. MGC Ludwigshafen e.V.","","","","","",""]
[25840,"Sw 1","Angela","Morgenstern","BGS Hardenberg-Pötter e.V.","","","","","",""]
[66745,"Sm 2","Peter","Morgenstern","Biskirchener BGV e.V.","","","","","",""]
[36599,"Sw 1","Brigitte","Morhardt","1. MGC Metzingen e.V.","","","","","",""]
[67020,"Sm 1","Rainer","Moritz","BGC Schweinfurt e.V.","","","","","",""]
[66564,"Jm","Daniel","Mörixbauer","1. MGC Süßen e.V.","","","","","",""]
[66727,"Sm 1","Jürgen","Mörixbauer","1. MGC Süßen e.V.","","","","","",""]
[3477,"Sm 2","Kurt","Morsch","MSV Berliner Bär e.V.","","","","","",""]
[12835,"Sw 2","Gisela","Morsch","MSV Berliner Bär e.V.","","","","","",""]
[37808,"H","Kevin","Morschick","BGC Dormagen e.V.","","","","","",""]
[37807,"Sm 1","Detlef","Morschick","BGC Dormagen e.V.","","","","","",""]
[38414,"H","Markus","Mosch","1. MGC Paderborn e.V.","","","","","",""]
[42254,"Sm 1","Rüdiger","Moser","VfM Bottrop e.V.","","","","","",""]
[66420,"Jm","Gereth Neville","Mössinger","BGSV Kerpen e.V.","","","","","",""]
[66421,"Jm","Colin","Mössinger","BGSV Kerpen e.V.","","","","","",""]
[36162,"Sm 2","Philipp","Most","MGC \"Stahlquelle\" Bad Bocklet","","","","","",""]
[38557,"H","Alexander ","Mrohs","Niendorfer MC","","","","","",""]
[67032,"Jm","Moritz","Mrozek","BSC Ennepetal e.V.","","","","","",""]
[28527,"Sm 1","Martin","Much","MSK Neheim-Hüsten e.V.","","","","","",""]
[40247,"H","Jan","Muckenhaupt","SSC Attendorn e.V.","","","","","",""]
[43491,"Sm 2","Willy","Mühlberg","SV Lurup Abt. Bahnengolf","","","","","",""]
[29511,"Sm 1","Dirk","Mühlenbeck","HMC Büttgen e.V.","","","","","",""]
[49369,"Sm 1","Dirk","Mühling","MGC Heven e.V.","","","","","",""]
[49363,"Sw 2","Irene","Mühling","MGC Heven e.V.","","","","","",""]
[66557,"Sm 2","Peter","Mühlstein","1. BGC Landshut e.V.","","","","","",""]
[67226,"Sw 2","Renate","Mühlstein","1. BGC Landshut e.V.","","","","","",""]
[38076,"Sm 2","Peter","Mulfinger","MGF Ottobrunn e.V.","","","","","",""]
[65620,"Sw 2","Karin","Mulfinger","MGF Ottobrunn e.V.","","","","","",""]
[20828,"Sm 1","Hans Dieter","Müllen","MGC Traben-Trarbach","","","","","",""]
[36660,"H","Roger","Müller","VfL Lohbrügge Abt. Bahnengolf","","","","","",""]
[32762,"H","Björn","Müller","MC Möve Cuxhaven","Ja","","","","",""]
[66682,"H","Marco","Müller","MGC Kassel","Ja","","","","",""]
[35740,"H","Benjamin","Müller","MGC Traben-Trarbach","","","","","",""]
[33774,"H","Patrick","Müller","MSC Bad Godesberg e.V.","","","","","",""]
[48182,"H","Dirk","Müller","MGC Freizeitzentrum Biebertal","","","","","",""]
[67245,"H","Frank","Müller","MGC Heven e.V.","","","","","",""]
[34023,"H","Sascha","Müller","BGC Bildstock e.V.","","","","","",""]
[38397,"D","Janina","Müller","MSV Berliner Bär e.V.","","","","","",""]
[38398,"D","Nicole","Müller","MSV Berliner Bär e.V.","","","","","",""]
[34616,"D","Laura","Müller","1. MGC Ludwigshafen e.V.","","","","","",""]
[38330,"Jm","Yannick","Müller","OMGC Ingolstadt e.V.","","","","","",""]
[26535,"Sm 1","Klaus","Müller","MGF Hilzingen 80 e.V.","","","","","",""]
[40622,"Sm 1","Peter","Müller","Miniaturgolf Sportclub Schriesheim e.V","","","","","",""]
[46389,"Sm 1","Ralf","Müller","Reinickendorfer MGC e.V.","","","","","",""]
[46141,"Sm 1","Michael","Müller","MGC Bad Feilnbach e.V.","","","","","",""]
[29586,"Sm 1","Stefan","Müller","BGSV Kerpen e.V.","","","","","",""]
[45001,"Sm 1","Michael","Müller","MC 62 Lüdenscheid e.V.","","","","","",""]
[65865,"Sm 1","Markus","Müller","Minigolfunion Neviges-Odenthal 1968 e.V.","","","","","",""]
[41049,"Sm 1","Volker","Müller","1. CKF Dudweiler e.V.","","","","","",""]
[45151,"Sm 1","Alexander","Müller","1. MGC Metzingen e.V.","","","","","",""]
[18367,"Sm 2","Wolfgang","Müller","VfL Lüneburg","Ja","","","","",""]
[66176,"Sm 2","Michael","Müller","SC Bad Münder","Ja","","","","",""]
[61373,"Sm 2","Günter","Müller","1. MGC Mannheim 1968 e.V.","","","","","",""]
[4754,"Sm 2","Heinz","Müller","BGC Schloß Paffendorf e.V.","","","","","",""]
[27319,"Sm 2","Friedrich","Müller","1. MGC Paderborn e.V.","","","","","",""]
[66029,"Sm 2","Josef","Müller","MGC Bergisch Gladbach Gierath e.V.","","","","","",""]
[66322,"Sm 2","Uwe","Müller","MGC Rot-Weiß Wanne-Eickel e.V.","","","","","",""]
[40912,"Sm 2","Axel","Müller","1. KC Homburg-Saar 1967 e.V.","","","","","",""]
[33080,"Sm 2","Berndt","Müller","MCE Sindelfingen e.V.","","","","","",""]
[34489,"Sw 2","Elli","Müller","MSC Bad Godesberg e.V.","","","","","",""]
[66028,"Sw 2","Helga","Müller","MGC Bergisch Gladbach Gierath e.V.","","","","","",""]
[43367,"Sm 2","Michael","Müllner","MC Ilvesheim e.V.","","","","","",""]
[66475,"H","Stephan","Mumberg","BSC Ennepetal e.V.","","","","","",""]
[65375,"Jw","Anna Lena","Münch","1. KC Homburg-Saar 1967 e.V.","","","","","",""]
[46494,"Sm 2","Roman","Münch","1. KC Homburg-Saar 1967 e.V.","","","","","",""]
[67175,"Schm","Farin","Münchhoff","MGC Ingolstadt e.V.","","","","","",""]
[67408,"Schm","Lukas Sanjah","Mundorf","1. Porzer MGC Grün-Weiß 1969 e.V.","","","","","",""]
[50851,"Sm 1","Dirk","Mundorf","1. Porzer MGC Grün-Weiß 1969 e.V.","","","","","",""]
[61685,"Sm 2","Heribert","Münker","SG Arheilgen Abt. Bahnengolf","","","","","",""]
[25741,"Sm 2","Christian","Münster","Minigolf-Club Diessen","","","","","",""]
[44517,"Sm 2","Raimund","Mürhoff","1. MGC Paderborn e.V.","","","","","",""]
[67122,"H","Pascal","Mutsch","1. MGC Metzingen e.V.","","","","","",""]
[1090,"H","Hendrik","Mylius","MGV Bremen","Ja","","","","",""]
[1641,"Sm 1","Frank","Mylius","MGV Bremen","Ja","","","","",""]
[40393,"Sm 1","Uwe","Mylius","BGC Bremen","Ja","","","","",""]
[40898,"Sw 1","Marion","Mylius","MGV Bremen","Ja","","","","",""]
[26399,"Sm 2","Norbert","Naber","1. MGC Epe 1978 e.V.","","","","","",""]
[32405,"H","Dirk","Nacke","1. MGC Gelsenkirchen e.V.","","","","","",""]
[36011,"H","Heiko","Nägele","MGC Schwaikheim e.V.","","","","","",""]
[42563,"Sm 1","Udo","Nagl","1. BGC Landshut e.V.","","","","","",""]
[42569,"Sw 1","Sabine","Nagl","1. BGC Landshut e.V.","","","","","",""]
[36824,"Sm 1","Martin","Nagler","MGC Unterschneidheim e.V.","","","","","",""]
[33110,"Sm 2","Xaver","Nagler","MGC Unterschneidheim e.V.","","","","","",""]
[35773,"Sm 2","Wolf-Dieter","Nähler","1. MGC Köln 1961 e.V.","","","","","",""]
[67007,"H","Daniel","Naujocks","MGC Dortmund Syburg e.V.","","","","","",""]
[45049,"Sm 1","Dirk Willi","Nebe","BGSC \"Gut Schlag\" Gladbeck e.V.","","","","","",""]
[29219,"Sm 1","Kurt","Nees","MGC Schwaikheim e.V.","","","","","",""]
[3938,"Sm 2","Rudolf","Nefzger","BSV 86 München e.V.","","","","","",""]
[66624,"Sm 2","Ernst-Georg","Negwer","BGC Schweinfurt e.V.","","","","","",""]
[66623,"Sw 2","Ursula","Negwer","BGC Schweinfurt e.V.","","","","","",""]
[27505,"Sm 1","Stefan","Neidig","1. MGC Mannheim 1968 e.V.","","","","","",""]
[66269,"Jm","Niklas","Nell","MGC Bad Waldsee 1990 e.V.","","","","","",""]
[33042,"Sm 1","Roland","Nell","MGC Bad Waldsee 1990 e.V.","","","","","",""]
[66967,"D","Sarah","Nellen","BGC Hannover","Ja","","","","",""]
[66360,"H","Benjamin","Nelles","MGC Kassel","Ja","28407","X","","",""]
[45733,"Sw 2","Ingrid","Netzband","1. MGC Metzingen e.V.","","","","","",""]
[37611,"D","Erika","Neuburger","SSV Ulm 1846 Abt. Bahnengolf","","","","","",""]
[37027,"Sm 1","Andreas","Neuburger","SSV Ulm 1846 Abt. Bahnengolf","","","","","",""]
[66301,"Jm","Dennis","Neudert","BGC Illertissen e.V.","","","","","",""]
[43062,"Sm 1","Oliver","Neudert","BGC Illertissen e.V.","","","","","",""]
[37047,"H","Marvin","Neufeld","BGS Hardenberg-Pötter e.V.","","","","","",""]
[48942,"Sm 1","Dieter","Neuhäuser","VfB Osnabrück e.V.","","","","","",""]
[25784,"Sm 1","Michael","Neuland","MGC Dormagen-Brechten e.V.","","","","","",""]
[67079,"H","Lukas","Neumann","SG  Weiterstadt 1886 e.V.","","","","","",""]
[29733,"H","Björn","Neumann","MC Möve Cuxhaven","Ja","","","","",""]
[38363,"H","Kevin ","Neumann","BGC Celle","Ja","26535","X","","",""]
[37955,"H","Lukas","Neumann","1. MGC Mainz e.V.","","","","","",""]
[67405,"H","Ruben","Neumann","BV Sennestadt","","","","","",""]
[32139,"D","Kathrin","Neumann","1. MGC Mainz e.V.","","","","","",""]
[37667,"Sm 1","Christian","Neumann","MGC Murnau am Staffelsee e.V.","","","","","",""]
[37668,"Sm 1","Michael","Neumann","MGC Murnau am Staffelsee e.V.","","","","","",""]
[42783,"Sm 1","Josef","Neumann","OMGC Ingolstadt e.V.","","","","","",""]
[66340,"Sm 1","Reiner","Neumann","BGC Bremen","Ja","","","","",""]
[37168,"Sm 2","Michael","Neumann","Minigolf Wölfe Rheinstetten 02","","","","","",""]
[35213,"Sm 2","Uwe","Neumann","BGC Bremen","Ja","","","","",""]
[33165,"Sw 2","Bärbel","Neumann","Tempelhofer MV Berlin e.V.","","","","","",""]
[32906,"Sw 2","Brigitte","Neumann","SC Bad Münder","Ja","","","","",""]
[65576,"Sw 2","Sabine","Neumann","BGC Celle","Ja","26534","","","","X"]
[67153,"Sw 2","Angelika","Neumann","BGC Wolfsburg","Ja","","","","",""]
[65850,"H","Niklas","Neumayer","MGF Ottobrunn e.V.","","","","","",""]
[66589,"Sm 1","Stephan","Neunzig","1. Münchener MGC e.V.","","","","","",""]
[28030,"Sm 1","Ralf","Neuwald","Miniaturgolf Sportclub Schriesheim e.V","","","","","",""]
[65600,"Jm","Fabian","Neuwirth","BGC Illertissen e.V.","","","","","",""]
[37473,"Sm 1","Waldemar","Neuwirth","1. MSC Wesel 6.6.1966 e.V.","","","","","",""]
[65599,"Sm 2","Dietmar","Neuwirth","BGC Illertissen e.V.","","","","","",""]
[67215,"Jw","Quynh Le","Ngoc","BGC Bad Mergentheim e.V.","","","","","",""]
[66071,"H","Thomas","Nichter","BIG ASPERG e.V.","","","","","",""]
[38005,"H","Dustin","Nickel","MGC Wetzlar e.V.","","","","","",""]
[46042,"H","Holger","Nickel","MGC Homburger Land e.V.","","","","","",""]
[37288,"Sm 2","Dieter","Nickel","PTSV Hof, Abt. Minigolf ","","","","","",""]
[46152,"Sm 2","Gerhard","Nickel","MGC Wetzlar e.V.","","","","","",""]
[46446,"H","Matthias","Nickerl","MGC Veitshöchheim","","","","","",""]
[66601,"Schm","David","Nickerl","1. MGC München-Feldmoching e.V.","","","","","",""]
[48138,"Sm 1","Alfred","Nickerl","1. MGC München-Feldmoching e.V.","","","","","",""]
[40306,"Sm 2","Richard","Niebler","BGC Neutraubling e.V.","","","","","",""]
[66206,"Sm 1","Jörg","Niebuhr","SV Gebhardshagen","Ja","28159","","X","",""]
[11191,"Sm 2","Dieter","Niederdräing","MGC Felderbachtal 1964 e.V.","","","","","",""]
[42044,"Sm 1","Andreas","Niedermeir","1. MGC München-Feldmoching e.V.","","","","","",""]
[42046,"Sm 1","Martin","Niedermeir","1. MGC München-Feldmoching e.V.","","","","","",""]
[37610,"Sm 2","Roland","Niedl","BGC Illertissen e.V.","","","","","",""]
[45006,"Sm 1","Thorsten","Niemann","MGC Bad Oldesloe e.V.","","","","","",""]
[52000,"Sm 1","Uwe","Niemtschke","TSV Arendsee e.V.","","","","","",""]
[67022,"D","Jacqueline","Niepel","MGC Rot-Weiß Wanne-Eickel e.V.","","","","","",""]
[66579,"Sw 1","Susanne","Niepel","MGC Rot-Weiß Wanne-Eickel e.V.","","","","","",""]
[67392,"Sm 2","Jean-Luc","Nihoul","BGS Hardenberg-Pötter e.V.","","","","","",""]
[30626,"H","Maik","Nikolaus","1. MGC Ludwigshafen e.V.","","","","","",""]
[34408,"D","Sandra","Nikolaus","1. BGC Rodalben 1977 e.V.","","","","","",""]
[66991,"Schw","Jana","Nikolaus","1. BGC Rodalben 1977 e.V.","","","","","",""]
[67311,"D","Britta","Nischk","MGC Bad Homburg vdH e.V.","","","","","",""]
[37551,"Sm 1","Michael","Nischk","MGC Bad Homburg vdH e.V.","","","","","",""]
[37550,"Sw 2","Erika","Nischk","MGC Bad Homburg vdH e.V.","","","","","",""]
[45189,"H","Holger","Nitsche","BGV Backumer Tal Herten e.V.","","","","","",""]
[26342,"Sm 1","Peter","Nitzki","MSV Berliner Bär e.V.","","","","","",""]
[43542,"Sm 1","Thomas","Nix","BIG ASPERG e.V.","","","","","",""]
[67214,"H","Danny","Noack","Minigolfclub Karlshagen e.V.","","","","","",""]
[31269,"H","Marcel","Noack","1. MGC Mainz e.V.","","","","","",""]
[66971,"Schm","Nevio","Noack","Minigolfclub Karlshagen e.V.","","","","","",""]
[34191,"Sm 2","Günter","Noack","1. MGC Mainz e.V.","","","","","",""]
[23516,"Sw 1","Christiane","Noch","Tempelhofer MV Berlin e.V.","","","","","",""]
[23517,"Sm 2","Frank","Noch","Tempelhofer MV Berlin e.V.","","","","","",""]
[66840,"Sm 2","Gerd","Nocon","1. MSC Wesel 6.6.1966 e.V.","","","","","",""]
[35738,"Sm 1","Harald","Nohr","BGC Celle","Ja","","","","",""]
[456,"Sm 2","Gerhard","Noll","1. MGC Mannheim 1968 e.V.","","","","","",""]
[30053,"Sw 2","Sigrid","Noll","1. MGC Mannheim 1968 e.V.","","","","","",""]
[32951,"Sw 2","Sylvia","Nolte","SC Bad Münder","Ja","","","","",""]
[67028,"Schm","Johannes","Nöth","MGV Ansbach e.V.","","","","","",""]
[67026,"Sm 1","Michael","Nöth","MGV Ansbach e.V.","","","","","",""]
[38541,"Sm 1","Alfred","Nowak","BGSC Bochum 1978 e.V.","","","","","",""]
[5511,"Sm 2","Wilfried","Nowak","MSK Neheim-Hüsten e.V.","","","","","",""]
[21500,"Sw 2","Marion","Nowak","MSK Neheim-Hüsten e.V.","","","","","",""]
[30639,"Sm 1","Peter","Nowsky","MGC Göttingen","Ja","","","","",""]
[66272,"Sw 1","Beatrix","Numberger","1. Münchener MGC e.V.","","","","","",""]
[43054,"Sm 2","Martin","Nuri-Kälble","BSV 82 Ohlsbach e.V.","","","","","",""]
[33491,"Sm 2","Rolf","Nutzenberger","1. MGC Mannheim 1968 e.V.","","","","","",""]
[33385,"Sm 2","Hermann","Oberding","Biskirchener BGV e.V.","","","","","",""]
[42510,"Sm 1","Frank","Oberhofer","MGF Hammer e.V.","","","","","",""]
[67002,"Sm 2","Klaus Peter","Oberländer","1. BGC Bad Füssing e.V.","","","","","",""]
[67003,"Sw 2","Wilma","Oberländer","1. BGC Bad Füssing e.V.","","","","","",""]
[50194,"H","Matthias","Ockerblohm","BGC 90 Ottobrunn e.V.","","","","","",""]
[36180,"H","Felix","Oehl","MV Lankwitzer Dragons","","","","","",""]
[35180,"D","Manuela","Oelschlegel","SC Bastion Rot Weiß Lippstadt e.V.","","","","","",""]
[40827,"Sm 2","Torsten","Offner","Hamburger MC von 1965 e.V.","","","","","",""]
[66701,"Sm 1","Roland","Ohletz","BGC Uerdingen e.V.","","","","","",""]
[38373,"Sw 2","Jutta","Ohly","1. MGC Metzingen e.V.","","","","","",""]
[29928,"Sm 1","Hans-Peter","Ohm","BGC Wolfsburg","Ja","","","","",""]
[35023,"Sw 2","Edith","Oitzinger","BV Sennestadt","","","","","",""]
[5184,"Sm 2","Emil","Oklmann","SSV Ulm 1846 Abt. Bahnengolf","","","","","",""]
[45418,"Sw 2","Carola","Oklmann","SSV Ulm 1846 Abt. Bahnengolf","","","","","",""]
[30123,"Sm 2","Michael","Olböter","1. Essener CGC \"Blau-Gold\" e.V.","","","","","",""]
[66809,"Jm","Torben","Oldhafer","TSV Salzgitter","Ja","","","","",""]
[42114,"Sm 1","Stefan","Opitz","BGC Hannover","Ja","","","","",""]
[35803,"Sw 2","Brigitte","Opitz","MGC Peine","Ja","","","","",""]
[34733,"H","David","Oppermann","BSC Ennepetal e.V.","","","","","",""]
[22422,"Sm 2","Ralf","Oppermann","BSC Ennepetal e.V.","","","","","",""]
[29740,"Sm 1","Arne","Oppmann","MSV Würzburg-Löwenbrücke e.V.","","","","","",""]
[40264,"Sm 1","Harald","Orth","MSV Bad Kreuznach","","","","","",""]
[29215,"Sm 1","Ingo","Ortner","MGC Schwaikheim e.V.","","","","","",""]
[45103,"Sm 1","Michael","Oseit","1. MC Weinheim e.V.","","","","","",""]
[26349,"Sm 2","Jörn","Osnabrügge","1. MGC Ludwigshafen e.V.","","","","","",""]
[3358,"Sm 2","Karl-Heinz","Oster","1. Porzer MGC Grün-Weiß 1969 e.V.","","","","","",""]
[40261,"H","Thomas","Öster","1. BGC München e.V.","","","","","",""]
[40298,"Sw 2","Christel","Öster","1. BGC München e.V.","","","","","",""]
[66338,"Sw 1","Gabriele","Osthushenrich","BGC Hannover","Ja","","","","",""]
[67161,"Schm","Joost","Otersen","BGC Bremen","Ja","","","","",""]
[30224,"H","Hans-Jörg","Ott","BGC Bad Berneck e.V.","","","","","",""]
[31026,"H","David","Ott","BGV Backumer Tal Herten e.V.","","","","","",""]
[31031,"H","Andy","Ott","BGV Backumer Tal Herten e.V.","","","","","",""]
[36193,"H","Philipp","Ott","BGSV Castrop e.V. 1961","","","","","",""]
[9296,"Sm 2","Norbert","Ott","BGV Backumer Tal Herten e.V.","","","","","",""]
[28292,"Sm 2","Berni","Ott","MGC 85 Bönnigheim","","","","","",""]
[43707,"Sw 2","Gerda","Ott","MGC 85 Bönnigheim","","","","","",""]
[66821,"H","Erwin","Ottaviani","BGS Hardenberg-Pötter e.V.","","","","","",""]
[29114,"Sm 1","Dirk","Otten","TSV Salzgitter","Ja","8983","","X","",""]
[28901,"Sw 1","Sabine","Otten","BGC Wolfsburg","Ja","8869","","X","",""]
[66950,"D","Elena","Ott-Fink","BGV Backumer Tal Herten e.V.","","","","","",""]
[48281,"Sm 1","Stefan","Ottinger","MGC Murnau am Staffelsee e.V.","","","","","",""]
[32793,"D","Meike","Otto","MGC Olympia Kiel e.V.","","","","","",""]
[36024,"Sm 2","Wolfgang","Otto","MSV Berliner Bär e.V.","","","","","",""]
[151,"Sm 2","Herbert","Otto","MGC Rot-Weiß Wanne-Eickel e.V.","","","","","",""]
[6524,"Sm 2","Kuno","Otto","MGC Olympia Kiel e.V.","","","","","",""]
[25020,"Sw 2","Karin","Otto","MGC Olympia Kiel e.V.","","","","","",""]
[67174,"Sm 1","Wolfgang","Ovzarek","1. CGC Blau-Gelb Grötzingen","","","","","",""]
[67173,"Sw 1","Petra","Ovzarek","1. CGC Blau-Gelb Grötzingen","","","","","",""]
[67291,"H","Taner","Özdeniz","MGC Bad Soden-Salmünster","","","","","",""]
[36770,"Sm 2","Kurt","Paar","MGC Bad Soden-Salmünster","","","","","",""]
[66565,"Jm","Ben","Paffrath","MGC Heven e.V.","","","","","",""]
[33511,"Sm 2","Siegfried","Paffrath","MGC Heven e.V.","","","","","",""]
[28473,"Sw 1","Gabi","Pahl","BGC Celle","Ja","","","","",""]
[61978,"Sm 2","Heinz","Pahl","BGC Celle","Ja","","","","",""]
[21494,"Sm 2","Horst","Pahl","MSK Neheim-Hüsten e.V.","","","","","",""]
[37073,"H","Kim-Kevin","Pajonk","TSV Arendsee e.V.","","","","","",""]
[37072,"Sw 1","Kathi","Pajonk","TSV Arendsee e.V.","","","","","",""]
[5757,"Sm 2","Klaus Peter","Palm","1. KC Homburg-Saar 1967 e.V.","","","","","",""]
[35611,"H","Olaf","Paltian","1. MGC Ludwigshafen e.V.","","","","","",""]
[50042,"H","Christian","Pannek","1. MGC Mainz e.V.","","","","","",""]
[37578,"H","Marc","Pape","1. KC Homburg-Saar 1967 e.V.","","","","","",""]
[66902,"Jm","Robert-Alexander","Pape","Elbhavelland e.V., Abt. Minigolfsport","","","","","",""]
[36258,"Sm 1","Ronald","Pape","MGV Bremen","Ja","14267","","X","",""]
[67331,"Sw 1","Christina","Pape","Elbhavelland e.V., Abt. Minigolfsport","","","","","",""]
[67330,"Sm 2","Jürgen","Pape","Elbhavelland e.V., Abt. Minigolfsport","","","","","",""]
[67289,"Sm 2","Ulrich","Pape","MSV Bad Kreuznach","","","","","",""]
[9750,"Sw 1","Sylvia","Pape-Münch","1. KC Homburg-Saar 1967 e.V.","","","","","",""]
[28746,"Sm 2","Karsten","Parbst","VfL Lohbrügge Abt. Bahnengolf","","","","","",""]
[30259,"Sw 2","Monika","Parbst","VfL Lohbrügge Abt. Bahnengolf","","","","","",""]
[33393,"Sw 1","Susanne","Parr","MSC Bensheim-Auerbach e.V.","","","","","",""]
[21298,"Sm 2","Walter","Parr","SV 1890 e.V. Dreieichenhain, Abt. Bahnengolf","","","","","",""]
[44244,"Sm 1","Sven","Pastwa","SC Olympia Dortmund e.V.","","","","","",""]
[40114,"H","Daniel","Patan","1. MGC Süßen e.V.","","","","","",""]
[66771,"Jw","Franziska","Patan","BIG ASPERG e.V.","","","","","",""]
[51850,"Sm 1","Bernhard","Patan","BIG ASPERG e.V.","","","","","",""]
[55130,"Sw 1","Sabine","Patan","BIG ASPERG e.V.","","","","","",""]
[35530,"H","Marcel","Patorra","BGC Bad Nenndorf","Ja","","","","",""]
[66577,"H","Michael","Pätz","1. BGC Bad Füssing e.V.","","","","","",""]
[46006,"H","Markus","Patzelt","BGSV Kerpen e.V.","","","","","",""]
[67213,"Sm 1","Gerd","Paul","MGC Bad Homburg vdH e.V.","","","","","",""]
[49350,"H","Achim","Paulsen","MGC Olympia Kiel e.V.","","","","","",""]
[33153,"Sm 1","Lars","Paulsen","MGC Harrislee-Wassersleben","","","","","",""]
[50354,"Sm 1","Steffen","Paulus","KGC Bad Urach e.V.","","","","","",""]
[25987,"Sw 2","Renate","Paulus","1. CKF Dudweiler e.V.","","","","","",""]
[36042,"Sw 2","Cornelia","Päuser","MGC Kassel","Ja","14051","","X","",""]
[4744,"Sm 2","Rudolf","Pavlas","MSV Bad Kreuznach","","","","","",""]
[66726,"Jm","Nicolas","Pawelka","Miniaturgolf Sportclub Schriesheim e.V","","","","","",""]
[66223,"Sm 1","Stephan","Pawelka","Miniaturgolf Sportclub Schriesheim e.V","","","","","",""]
[34757,"H","Sebastian","Peffer","Niendorfer MC","","","","","",""]
[34562,"Sm 2","Willi","Peffer","1. BGC Wesseling 1975 e.V.","","","","","",""]
[34464,"Sw 1","Regina","Peffermann","1. Porzer MGC Grün-Weiß 1969 e.V.","","","","","",""]
[33490,"Sm 1","Kurt","Peinelt","1. MGC Ludwigshafen e.V.","","","","","",""]
[35571,"H","Igor","Pekrul","MGC putter Künzell 1970 e.V.","","","","","",""]
[36243,"D","Tanja","Pekrul","MGC putter Künzell 1970 e.V.","","","","","",""]
[66596,"Sw 1","Doris","Pellkofer","BGC Hamm 1959 e.V.","","","","","",""]
[66595,"Sm 2","Jürgen","Pellkofer","BGC Hamm 1959 e.V.","","","","","",""]
[37558,"H","Daniel","Peppler","Reinickendorfer MGC e.V.","","","","","",""]
[27520,"Sm 1","Peter","Perle","1. MGC Mannheim 1968 e.V.","","","","","",""]
[40366,"Sm 1","Klaus","Perlich","OMGC Ingolstadt e.V.","","","","","",""]
[67040,"H","Tobias","Peschke","MGC Rot-Weiß Wanne-Eickel e.V.","","","","","",""]
[32975,"H","Philipp","Pester","SG Arheilgen Abt. Bahnengolf","","","","","",""]
[32976,"H","Magnus","Pester","MGC putter Künzell 1970 e.V.","","","","","",""]
[26809,"Sm 1","Manfred","Pester","TSV Pfungstadt Abt. Bahnengolf e.V.","","","","","",""]
[50128,"H","Timo","Peter","BIG ASPERG e.V.","","","","","",""]
[7607,"Sm 2","Uwe","Peter","BGC Celle","Ja","","","","",""]
[45445,"Sm 2","Alois","Peter","MGC Bad Waldsee 1990 e.V.","","","","","",""]
[65723,"Sm 2","Rainer","Petermann","SC Wermelskirchen 1976 e.V.","","","","","",""]
[65722,"Sw 2","Dora-Gisela","Petermann","SC Wermelskirchen 1976 e.V.","","","","","",""]
[66949,"Jm","Moritz","Peters","Hamburger MC von 1965 e.V.","","","","","",""]
[37020,"Sm 2","Hartmut","Peters","SC Gut Heil Neumünster e.V.","","","","","",""]
[67371,"H","Robin","Petersen","SC Olympia Dortmund e.V.","","","","","",""]
[66924,"Sm 1","Detlef","Petersen","BGC Hannover","Ja","","","","",""]
[67292,"Sm 2","Reinhold","Petersik","TV Niederstetten 1862 e.V.  Abt. Minigolf","","","","","",""]
[66820,"H","Mickael","Petit","BGS Hardenberg-Pötter e.V.","","","","","",""]
[62294,"Sm 2","Jobst","Petrina","TV Trappenkamp e.V. - Minigolf -","","","","","",""]
[35459,"Sm 2","Herbert","Peucker","SV Gebhardshagen","Ja","","","","",""]
[36821,"Sw 2","Karin","Peucker","SV Gebhardshagen","Ja","","","","",""]
[37241,"H","Mirko","Peuker","BGC Dormagen e.V.","","","","","",""]
[37242,"D","Vanessa","Peuker","MGC Dormagen-Brechten e.V.","","","","","",""]
[43327,"Sm 2","Hans-Jürgen","Peuker","BGC Dormagen e.V.","","","","","",""]
[22574,"Sm 2","Roland","Pfeffer","SV 1890 e.V. Dreieichenhain, Abt. Bahnengolf","","","","","",""]
[17476,"Sm 2","Werner","Pfeffer","1. MGC Mannheim 1968 e.V.","","","","","",""]
[24619,"Sm 2","Lutz","Pfeffer","Kölner Miniatur Golf Club e.V.","","","","","",""]
[66167,"Sm 2","Reinhard","Pfeffer","MC Georgsmarienhütte e.V.","","","","","",""]
[67104,"Sm 1","Norbert","Pfeifer","MGV Ansbach e.V.","","","","","",""]
[31259,"Sm 2","Holger","Pfeiffer","Biskirchener BGV e.V.","","","","","",""]
[34951,"Sw 1","Cynthia","Pfingst","BGC Leipzig","","","","","",""]
[30926,"H","Thomas","Pfister","ASV Pegnitz, Abt. Minigolf","","","","","",""]
[12405,"Sm 2","Klaus","Pfriem","MGC Peine","Ja","","","","",""]
[47213,"Sw 2","Heiderose","Pfriem","MGC Peine","Ja","20223","","X","","X"]
[29801,"H","Simon","Philipp","MGF Hilzingen 80 e.V.","","","","","",""]
[66052,"Sm 1","Andreas","Philipp","VfM e.V. Berlin ","","","","","",""]
[67024,"H","Lukas","Philippus","BGSV Bad Homburg","","","","","",""]
[30834,"Sm 2","Bernhard","Pianka","BV Sennestadt","","","","","",""]
[45614,"Sm 2","Klaus","Pichler","MGC 85 Bönnigheim","","","","","",""]
[31032,"H","Thorsten","Pichol","BGV Backumer Tal Herten e.V.","","","","","",""]
[38272,"D","Maike","Pichol","BGV Backumer Tal Herten e.V.","","","","","",""]
[66184,"Jw","Michelle","Pichol","BGV Backumer Tal Herten e.V.","","","","","",""]
[42849,"Sm 1","Markus","Piechota","SSC Attendorn e.V.","","","","","",""]
[36538,"Sw 2","Rosemarie","Piechotta","MGC Dortmund Syburg e.V.","","","","","",""]
[41953,"Sm 2","Armando","Piedigaci","SC Wermelskirchen 1976 e.V.","","","","","",""]
[65977,"Sm 1","Werner","Piehl","MGC Bergisch Gladbach Gierath e.V.","","","","","",""]
[37859,"H","Sebastian","Piekorz","1. MGC Mainz e.V.","","","","","",""]
[37860,"Sm 2","Wolfgang","Piekorz","BGC Bad Mergentheim e.V.","","","","","",""]
[36637,"H","Markus","Pieper","MGC Traben-Trarbach","","","","","",""]
[43980,"H","Oliver","Pieper","MGC Traben-Trarbach","","","","","",""]
[35658,"D","Sabrina","Pieper","MGC Traben-Trarbach","","","","","",""]
[5324,"Sm 2","Ulrich","Pieper","MGC Traben-Trarbach","","","","","",""]
[66129,"Sm 1","Andreas","Pieplau","MGC Millennium Lorsch e.V.","","","","","",""]
[38267,"Sm 2","Armin","Piest","MGC Brunsbüttel e.V.","","","","","",""]
[36654,"Sm 1","Harald","Pietsch","1. MGC Gelsenkirchen e.V.","","","","","",""]
[38243,"Sm 2","Peter","Pilz","MGF Ottobrunn e.V.","","","","","",""]
[50457,"Sm 2","Karl-Heinz","Pindor","BGV Backumer Tal Herten e.V.","","","","","",""]
[35460,"Sw 1","Viola","Piper","SV Gebhardshagen","Ja","","","","",""]
[38279,"Sm 1","Matthias","Pipke","BGSC Bochum 1978 e.V.","","","","","",""]
[33364,"Sm 2","Wolfgang","Pirrung","1. KC Homburg-Saar 1967 e.V.","","","","","",""]
[29305,"Sm 2","Gerhard","Pischel","MGC Wolnzach e.V.","","","","","",""]
[36237,"Sm 1","Gerhard","Pitterle","MGC Bad Feilnbach e.V.","","","","","",""]
[46458,"Sm 2","Rolf","Pittner","BV Sennestadt","","","","","",""]
[40567,"Sm 2","Siegfried","Pitz","1. CGC Blau-Gelb Grötzingen","","","","","",""]
[48880,"Sm 1","Joachim","Plack","KGC Bad Urach e.V.","","","","","",""]
[36206,"H","Daniel","Platz","Freizeit Club Bliesen e.V.","","","","","",""]
[31933,"Sm 1","Stefan","Pleger","BGC Bad Nenndorf","Ja","","","","",""]
[67136,"Sm 1","Steffen","Plep","MGC Bad Bodendorf e.V.","","","","","",""]
[43572,"Sm 1","Stefan","Plieninger","1. BGC Landshut e.V.","","","","","",""]
[67265,"Sw 1","Andrea","Ploch","CGC Rauschenberg e.V.","","","","","",""]
[40689,"Sm 2","Hans","Ploem","MSV Bad Kreuznach","","","","","",""]
[26514,"Sw 2","Christiane","Ploem","MSV Bad Kreuznach","","","","","",""]
[10662,"Sm 2","Günther","Plötz","Tempelhofer MV Berlin e.V.","","","","","",""]
[66693,"Sm 1","Michael","Pohler","Minigolf-Club Diessen","","","","","",""]
[6076,"Sm 2","Necdet","Polat","SV Lurup Abt. Bahnengolf","","","","","",""]
[67162,"H","Ivo-René","Polpitz","BGC Northeim","Ja","","","","",""]
[66105,"Sm 1","Steffen","Poltermann","MGC Millennium Lorsch e.V.","","","","","",""]
[67239,"H","Jan","Pommer","BGC Hannover","Ja","","","","",""]
[67240,"Sw 2","Christine","Pommer","BGC Hannover","Ja","","","","",""]
[65823,"Sw 2","Ilona","Pommereit","SV Gebhardshagen","Ja","","","","",""]
[44073,"Sm 1","Michael","Ponellis","1. MSC Wesel 6.6.1966 e.V.","","","","","",""]
[66794,"H","Ivan","Popleteev","MGC putter Künzell 1970 e.V.","","","","","",""]
[36776,"H","Fabian","Pöppe","BGSC Bochum 1978 e.V.","","","","","",""]
[37658,"Sm 2","Alfred","Pöppe","BGSC Bochum 1978 e.V.","","","","","",""]
[36981,"Sw 2","Birgit","Pöppe","BGSC Bochum 1978 e.V.","","","","","",""]
[5270,"Sm 2","Heinz","Pörrer","TG Höchberg von 1862 Bahnengolf e.V.","","","","","",""]
[36696,"Sw 2","Barbara","Pörrer","OMGC Ingolstadt e.V.","","","","","",""]
[49243,"H","Alexander","Porsch","ASV Pegnitz, Abt. Minigolf","","","","","",""]
[49886,"Sm 1","Stefan","Poser","BGC Hannover","Ja","21253","","X","",""]
[49887,"Sw 1","Heike","Poser","BGC Hannover","Ja","","","","",""]
[33993,"Sm 2","Jürgen","Praedel","MGC Rot-Weiß Wanne-Eickel e.V.","","","","","",""]
[43697,"Sm 1","Gerald","Prause","MGC Göttingen","Ja","","","","",""]
[66608,"H","Lars","Prediger","VfL Lüneburg","Ja","","","","",""]
[67415,"Sm 2","Robert","Preißler","MSG Kempten e.V.","","","","","",""]
[38577,"Sm 2","Stephan","Preißmann","BGSV Bad Homburg","","","","","",""]
[37322,"H","David","Pren","1. MSC Wesel 6.6.1966 e.V.","","","","","",""]
[67151,"Sm 1","Wolfgang","Presser","MGC Heven e.V.","","","","","",""]
[66981,"Jm","Gerald","Pressmar-Danne","1. MC Weinheim e.V.","","","","","",""]
[6767,"Sm 2","Walter","Pribuß","BGC Illertissen e.V.","","","","","",""]
[36550,"Sm 2","Heinz","Pribyl","1. Minigolf-Club Rheinhausen e.V.","","","","","",""]
[66670,"Sm 1","Ulrich","Priedigkeit","BGC Uerdingen e.V.","","","","","",""]
[66671,"Sw 1","Gudrun","Priedigkeit","BGC Uerdingen e.V.","","","","","",""]
[30201,"D","Stephanie","Pries","Preetzer TSV von 1861 e.V. Abt. Minigolf","","","","","",""]
[66841,"D","Anne-Katrin","Prill","Minigolfclub Karlshagen e.V.","","","","","",""]
[66529,"Sm 2","Norbert","Probost","MGC Wetzlar e.V.","","","","","",""]
[17592,"Sm 2","Herbert","Probst","BGC Bildstock e.V.","","","","","",""]
[26092,"H","Michael","Proschko","1. BGC Bad Füssing e.V.","","","","","",""]
[66484,"Sm 2","Franz jr.","Proschko","1. BGC Bad Füssing e.V.","","","","","",""]
[35158,"H","Dominik","Prüßner","MGC Bad Salzuflen e.V.","","","","","",""]
[10566,"Sm 2","Johann","Pscherer jun.","MSK Olching e.V.","","","","","",""]
[30634,"H","Rudolf","Pull","1. MGC Mainz e.V.","","","","","",""]
[67180,"Sw 1","Ly","Puschner","BGC Bad Mergentheim e.V.","","","","","",""]
[66528,"Sm 2","Gerhard","Puschner","BGC Bad Mergentheim e.V.","","","","","",""]
[5509,"Sw 2","Marianne","Quade","MGC Bad Salzuflen e.V.","","","","","",""]
[44691,"Sm 1","Frank","Quandt","TSV Salzgitter","Ja","18684","","","",""]
[24081,"Sm 1","Jürgen","Quandt","HMC Büttgen e.V.","","","","","",""]
[37784,"Sm 1","Thorsten","Quantz","MGC Heringen 1997 e.V.","","","","","",""]
[22150,"Sm 2","Andreas","Quelle","BSV 86 München e.V.","","","","","",""]
[38420,"Sm 1","Martin","Quickels","MGC Rot-Weiß Wanne-Eickel e.V.","","","","","",""]
[62816,"Sm 2","Sieghardt","Quitsch","SV Lurup Abt. Bahnengolf","","","","","",""]
[61546,"Sw 2","Ruth","Quitsch","SV Lurup Abt. Bahnengolf","","","","","",""]
[66373,"Sm 2","Dieter","Rach","1. MGC Paderborn e.V.","","","","","",""]
[66549,"H","Florian","Rachl","MSG Kempten e.V.","","","","","",""]
[66550,"D","Conny","Rachl","MSG Kempten e.V.","","","","","",""]
[66551,"Sm 1","Armin","Rachl","MSG Kempten e.V.","","","","","",""]
[38625,"H","Marcus","Rade","MGC \"AS\" Witten 1963 e.V.","","","","","",""]
[66861,"Schw","Lina","Rademacher","MGC Rot-Weiß Wanne-Eickel e.V.","","","","","",""]
[66862,"Sw 1","Birgit","Rademacher","MGC Rot-Weiß Wanne-Eickel e.V.","","","","","",""]
[34051,"Sm 2","Wolfgang","Rademacher","MGC Göttingen","Ja","","","","",""]
[37656,"Sw 2","Sonja","Radocaj","MSK Olching e.V.","","","","","",""]
[4855,"Sm 2","Wolfgang","Radtke","MGC Rot-Weiß Wanne-Eickel e.V.","","","","","",""]
[48343,"H","Mark","Radziejewski","MGC putter Künzell 1970 e.V.","","","","","",""]
[36793,"H","Dustin","Raffler","1. Essener CGC \"Blau-Gold\" e.V.","","","","","",""]
[10650,"Sm 2","Walther","Raffler","1. Essener CGC \"Blau-Gold\" e.V.","","","","","",""]
[31752,"H","Timur","Rahman","MGC putter Künzell 1970 e.V.","","","","","",""]
[46295,"Sw 1","Gabriele","Rahmlow","SV Lurup Abt. Bahnengolf","","","","","",""]
[4654,"Sw 2","Brunhilde","Rahmlow","SV Lurup Abt. Bahnengolf","","","","","",""]
[66633,"Sm 1","Wolfgang","Raimann","MGC Bergisch Gladbach Gierath e.V.","","","","","",""]
[27206,"D","Bianca","Raith","MGC Oberkochen e.V.","","","","","",""]
[43192,"Sm 1","Richard","Raith","MGC Oberkochen e.V.","","","","","",""]
[32862,"H","Tobias","Ramcke","MC Tigers Künsebeck","","","","","",""]
[37213,"H","René","Ramming","BGC Bad Berneck e.V.","","","","","",""]
[45764,"Sm 2","Eduard","Rankel","MGC Bad Bodendorf e.V.","","","","","",""]
[37655,"Sm 2","Roland","Ranzinger","MGC Ingolstadt e.V.","","","","","",""]
[44276,"Sm 1","Michael","Rapp","MGF Hammer e.V.","","","","","",""]
[36567,"H","Marcel","Raschke","BGC Diepholz","Ja","14576","","X","","X"]
[44728,"H","Benjamin","Raschke","BGC Bremen","Ja","18708","","X","","X"]
[66379,"Sm 1","Jörg","Raschke","Biskirchener BGV e.V.","","","","","",""]
[884,"D","Isabell","Raschke-Dejoks","BGC Diepholz","Ja","2449","","","",""]
[34099,"Sm 2","Gerhard","Rassler","Minigolfunion Neviges-Odenthal 1968 e.V.","","","","","",""]
[34086,"Sw 2","Claudia","Rassler","Minigolfunion Neviges-Odenthal 1968 e.V.","","","","","",""]
[67309,"Schm","Lucas","Rastetter","1. CGC Blau-Gelb Grötzingen","","","","","",""]
[31213,"Sm 1","Thomas","Rastetter","1. CGC Blau-Gelb Grötzingen","","","","","",""]
[65851,"Sm 2","Robert","Rastetter","Minigolf Wölfe Rheinstetten 02","","","","","",""]
[65824,"Sm 1","Markus","Rath","SV Gebhardshagen","Ja","27405","","","","X"]
[43263,"Sw 1","Elke","Rath","SG Arheilgen Abt. Bahnengolf","","","","","",""]
[23693,"Sm 1","Udo","Rathje","MGC Olympia Kiel e.V.","","","","","",""]
[51902,"Sm 1","Oliver","Rathjens","1. MSC Wesel 6.6.1966 e.V.","","","","","",""]
[67138,"D","Eva","Rättig","SV Gebhardshagen","Ja","","","","",""]
[42343,"Sm 1","Josef","Rauch","MGC Ingolstadt e.V.","","","","","",""]
[26213,"H","Stephan","Rauh-Buchwald","BGC Illertissen e.V.","","","","","",""]
[42585,"Sm 1","Martin","Rausch","MGC putter Künzell 1970 e.V.","","","","","",""]
[47353,"Sm 2","Joachim","Rautenberg","MGC Heven e.V.","","","","","",""]
[66721,"Sm 1","Stefan","Rebstock","Hamburger MC von 1965 e.V.","","","","","",""]
[37325,"Sm 1","Jens","Rechenmacher","VfB Osnabrück e.V.","","","","","",""]
[37978,"H","Sven","Reckmann","SC Bastion Rot Weiß Lippstadt e.V.","","","","","",""]
[36015,"D","Kerstin","Reder","TSV Kücknitz Abt. Bahnengolf","","","","","",""]
[37501,"D","Maike","Reese","MGC Felderbachtal 1964 e.V.","","","","","",""]
[50224,"Sm 1","Andreas","Reese","MSK Neheim-Hüsten e.V.","","","","","",""]
[6208,"Sm 2","Bernd","Reh","BGS Hardenberg-Pötter e.V.","","","","","",""]
[43640,"Sm 1","Norbert","Rehfeld","BGV Bergisch Land 1962 / 63 e.V.","","","","","",""]
[34994,"Sw 1","Sabine","Rehse","BGSC Bochum 1978 e.V.","","","","","",""]
[44515,"Sm 2","Klaus","Rehse","1. MGC Paderborn e.V.","","","","","",""]
[65945,"H","Alexander","Reich","1. BGC Landshut e.V.","","","","","",""]
[32470,"H","Matthias","Reiche","BGC Leipzig","","","","","",""]
[37198,"H","Bastian","Reichert","TV Niederstetten 1862 e.V.  Abt. Minigolf","","","","","",""]
[34731,"Sm 1","Michael","Reichert","MGC Unterschneidheim e.V.","","","","","",""]
[40054,"Sm 1","Thomas","Reichert","TV Niederstetten 1862 e.V.  Abt. Minigolf","","","","","",""]
[34727,"Sm 2","Hermann","Reichert","TV Niederstetten 1862 e.V.  Abt. Minigolf","","","","","",""]
[26125,"H","Matthias","Reichle","BSV Inzlingen 1979 e.V.","","","","","",""]
[43382,"H","Stefan","Reichle","BSV Inzlingen 1979 e.V.","","","","","",""]
[67023,"Schm","Ben","Reichle","BSV Inzlingen 1979 e.V.","","","","","",""]
[42375,"Sm 1","Dirk","Reichle","1. MGC Ladenburg e.V.","","","","","",""]
[3975,"Sm 2","Urs","Reichle","BSV Inzlingen 1979 e.V.","","","","","",""]
[32876,"Sw 2","Heidi","Reichle","BSV Inzlingen 1979 e.V.","","","","","",""]
[46907,"Sm 1","Jens","Reimann","SV Gebhardshagen","Ja","20057","X","","","X"]
[18172,"Sm 2","Werner","Reimer","VfM Bottrop e.V.","","","","","",""]
[17220,"Sw 2","Inge","Reimer","VfM Bottrop e.V.","","","","","",""]
[40617,"Sm 1","Franz","Reimling","MC Ilvesheim e.V.","","","","","",""]
[49312,"H","Andy","Rein","1. BGC Rodalben 1977 e.V.","","","","","",""]
[66993,"Schw","Leonie","Rein","1. BGC Rodalben 1977 e.V.","","","","","",""]
[5691,"Sm 2","Heinz","Rein","BG Pfullingen","","","","","",""]
[6215,"Sm 2","Franz-Josef","Reinartz","1.KGC Mönchengladbach e.V.","","","","","",""]
[67337,"H","André","Reinhardt","MGC Ostheim / Rhön e.V.","","","","","",""]
[36966,"Sm 1","Günther","Reinhardt","1. Essener CGC \"Blau-Gold\" e.V.","","","","","",""]
[6838,"Sm 2","Manfred","Reinhardt","BGC Heilbronn e.V.","","","","","",""]
[44862,"Sw 1","Andrea","Reinicke","MC Möve Cuxhaven","Ja","18799","","X","","X"]
[42690,"Sm 2","Michael","Reinicke","MC Möve Cuxhaven","Ja","17596","","X","","X"]
[42691,"Sm 2","Frank","Reinicke","MC Möve Cuxhaven","Ja","17597","","X","","X"]
[49802,"D","Corina","Reinisch","BGC Neutraubling e.V.","","","","","",""]
[63580,"Schm","Tim","Reinisch","BGC Neutraubling e.V.","","","","","",""]
[64926,"Schm","Klaus Richard Friedrich","Reinisch","BGC Neutraubling e.V.","","","","","",""]
[43664,"Sm 1","Roman","Reinisch","BGC Neutraubling e.V.","","","","","",""]
[4065,"Sm 2","Klaus","Reinisch","BGC Neutraubling e.V.","","","","","",""]
[4076,"Sw 2","Hildegard","Reinisch","BGC Neutraubling e.V.","","","","","",""]
[50558,"Sm 2","Jürgen","Reinshagen","MGC Bergisch Gladbach Gierath e.V.","","","","","",""]
[45515,"Sm 2","Hans","Reisdorff","MGC Bad Bodendorf e.V.","","","","","",""]
[4138,"Sw 2","Anneliese","Reisdorff","MGC Bad Bodendorf e.V.","","","","","",""]
[48140,"H","Alexander","Reiss","BGC Illertissen e.V.","","","","","",""]
[48968,"Sm 1","Wolfgang","Reiss","1. NMC Kelheim e.V.","","","","","",""]
[30685,"Sw 1","Karin","Reiss","BIG ASPERG e.V.","","","","","",""]
[33172,"D","Maria-Ina","Reißmann","MGV Eibenstock","","","","","",""]
[32817,"Sm 1","Volkmar","Reißmann","MGV Eibenstock","","","","","",""]
[66612,"D","Lea","Reitemeier","MGC Rot-Weiß Wanne-Eickel e.V.","","","","","",""]
[66613,"Sm 2","Michael","Reitemeier","MGC Rot-Weiß Wanne-Eickel e.V.","","","","","",""]
[45574,"Sm 1","Josef","Reiter","MGF Hammer e.V.","","","","","",""]
[51479,"Sm 1","Thomas","Remscheidt","SSC Attendorn e.V.","","","","","",""]
[18339,"Sm 2","Klaus","Remscheidt","SSC Attendorn e.V.","","","","","",""]
[18338,"Sw 2","Anni","Remscheidt","SSC Attendorn e.V.","","","","","",""]
[66850,"Sm 2","Uwe","Rennert","TSV 1848 Flöha","","","","","",""]
[67222,"Sm 1","Christopher","Ressing","BGC Oberhausen e.V.","","","","","",""]
[5603,"Sm 2","Wilfried","Reßler","MGC Lippe-Detmold e.V.","","","","","",""]
[66374,"Jw","Elina","Rettinger","MGC Göttingen","Ja","","","","",""]
[66375,"Sm 1","Jürgen","Rettinger","MGC Göttingen","Ja","","","","",""]
[46579,"Sm 1","Manfred","Retzlaff","BIG ASPERG e.V.","","","","","",""]
[46595,"Sw 1","Brigitte","Retzlaff","BIG ASPERG e.V.","","","","","",""]
[37449,"Sw 1","Brigitte","Reul","BGSV Bad Homburg","","","","","",""]
[66774,"Schm","Raphael","Reuter","MGC Lohfelden","Ja","","","","",""]
[67011,"Sm 2","Kurt","Reuter","MGC Lohfelden","Ja","29404","X","","",""]
[66656,"H","Michel","Rhyn","SG Arheilgen Abt. Bahnengolf","","","","","",""]
[34628,"H","Ilario","Ricci","BGC Wolfsburg","Ja","","","","",""]
[27886,"Sm 1","Andreas","Richard","1. MGC Süßen e.V.","","","","","",""]
[37042,"H","Andreas","Richard jun.","MGC Schwaikheim e.V.","","","","","",""]
[65809,"H","Tobias","Richter","1. MC Weinheim e.V.","","","","","",""]
[34904,"H","Mike","Richter","MGV Eibenstock","","","","","",""]
[66445,"H","Adrian","Richter","BSV AOK Leipzig e.V.","","","","","",""]
[31089,"Sw 1","Anja","Richter","BGC Uerdingen e.V.","","","","","",""]
[47480,"Sm 2","Siegfried","Richter","1.KGC Mönchengladbach e.V.","","","","","",""]
[31071,"Sw 1","Pia","Riebesam","HMC Büttgen e.V.","","","","","",""]
[43517,"Sm 1","Mirko","Riecken","MC Flora Elmshorn e.V.","","","","","",""]
[43372,"Sm 1","Ralf","Riedel","1. MGC Tuttlingen e.V.","","","","","",""]
[43376,"Sm 1","Kurt","Riedel","1. MGC Tuttlingen e.V.","","","","","",""]
[43350,"Sm 2","Wolfgang","Rieder","MGF Waldshut 74 e.V.","","","","","",""]
[43435,"Sw 2","Elisabeth","Riedl","1. MGC Mitterteich-Großbüchlberg","","","","","",""]
[66700,"Jm","Niklas","Riedlinger","1. MGC Hechingen","","","","","",""]
[67369,"Sm 2","Fred","Riegel","Tempelhofer MV Berlin e.V.","","","","","",""]
[66239,"Sm 1","Erik","Rieger","MGC Bad Soden-Salmünster","","","","","",""]
[31344,"Sm 1","Markus","Rieker","1. MGC Tuttlingen e.V.","","","","","",""]
[66286,"D","Vanessa","Riemann","MGC Kassel","Ja","","","","",""]
[41463,"Sm 1","Carsten","Riemann","MGC Göttingen","Ja","","","","",""]
[42684,"Sw 1","Susanne","Riemann","MGC Kassel","Ja","","","","",""]
[66493,"Sw 1","Karin","Riemann","MGC Bad Salzuflen e.V.","","","","","",""]
[66494,"Sm 2","Lothar","Riemann","MGC Bad Salzuflen e.V.","","","","","",""]
[36048,"Sm 1","Klaus","Riepe","MGC Harrislee-Wassersleben","","","","","",""]
[6783,"Sm 2","Karl-Ludwig","Ries","MSV Bad Kreuznach","","","","","",""]
[33348,"Sw 2","Anke","Riesbeck","Preetzer TSV von 1861 e.V. Abt. Minigolf","","","","","",""]
[67196,"Jm","Philipp","Riesch","BGSV Castrop e.V. 1961","","","","","",""]
[42608,"Sm 2","Ulrich","Riesenbeck","1.KGC Mönchengladbach e.V.","","","","","",""]
[66619,"Jm","Ole","Riewe","TG Höchberg von 1862 Bahnengolf e.V.","","","","","",""]
[42965,"Sm 2","Norbert","Ring","HMC Büttgen e.V.","","","","","",""]
[37236,"Sm 2","Karl","Ring","MGC Unterschneidheim e.V.","","","","","",""]
[29539,"H","Daniel","Ringes","HMC Büttgen e.V.","","","","","",""]
[38262,"Sw 1","Angelika Pia","Ringler","1. MGC Tuttlingen e.V.","","","","","",""]
[31221,"H","Andreas","Ringshandl","1. NMC Kelheim e.V.","","","","","",""]
[48112,"Sm 2","Walter","Rinke","MC Flora Elmshorn e.V.","","","","","",""]
[66410,"H","Lukas","Rinker","MGC Wetzlar e.V.","","","","","",""]
[37586,"H","Joshua","Rischar","1. MGC Saar 68 St. Ingbert e.V.","","","","","",""]
[37587,"Sm 1","Hans-Werner","Rischar","1. MGC Saar 68 St. Ingbert e.V.","","","","","",""]
[65974,"Sm 1","Oliver","Rissling","MGC Bergisch Gladbach Gierath e.V.","","","","","",""]
[38165,"H","Florian","Ristow","MGC 85 Bönnigheim","","","","","",""]
[38371,"Sm 2","Wolfgang","Ristow","1. MGC Paderborn e.V.","","","","","",""]
[33975,"H","Michael","Ritschel","Miniaturgolf Sportclub Schriesheim e.V","","","","","",""]
[5020,"Sm 2","Reiner","Ritschel","Miniaturgolf Sportclub Schriesheim e.V","","","","","",""]
[38544,"Sm 2","Klaus","Ritschel","MGC \"Stahlquelle\" Bad Bocklet","","","","","",""]
[36285,"Sm 1","Uwe","Ritschmann","BGC Heilbronn e.V.","","","","","",""]
[36284,"Sw 1","Claudia","Ritschmann","BGC Heilbronn e.V.","","","","","",""]
[66773,"H","Sascha","Ritterbusch","MGC Kassel","Ja","","","","",""]
[44193,"Sm 1","Thorsten","Ritz","BGSC \"Gut Schlag\" Gladbeck e.V.","","","","","",""]
[43368,"Sm 1","Andreas","Ritzert","MC Ilvesheim e.V.","","","","","",""]
[42533,"Sw 1","Bettina","Ritzert","MC Ilvesheim e.V.","","","","","",""]
[33395,"Sw 2","Eva","Rochel","SGC Hagen e.V.","","","","","",""]
[66915,"Sm 1","Jens","Rockstroh","TSV 1848 Flöha","","","","","",""]
[49852,"Sm 1","Detlef","Rode","SV Lurup Abt. Bahnengolf","","","","","",""]
[66037,"H","Andreas","Rödig","MGC Bad Feilnbach e.V.","","","","","",""]
[19330,"Sm 2","Peter","Rödiger","MGC Wetzlar e.V.","","","","","",""]
[34792,"H","Timo","Roessler","1. MGC Metzingen e.V.","","","","","",""]
[66856,"Sm 1","Heinz-Friedrich","Rogall","MGC Felderbachtal 1964 e.V.","","","","","",""]
[37470,"Sm 1","Thomas","Rogge","MV Lankwitzer Dragons","","","","","",""]
[66697,"H","Jens","Rogler","Minigolfclub Karlshagen e.V.","","","","","",""]
[43860,"Sm 2","Uwe","Rohard","MGC Brunsbüttel e.V.","","","","","",""]
[36873,"H","Dennis","Rohde","TSV Kücknitz Abt. Bahnengolf","","","","","",""]
[33429,"Sm 2","Gerhard","Röhl","TSV Arendsee e.V.","","","","","",""]
[67110,"Sw 1","Sabine","Röhrl","MSK Olching e.V.","","","","","",""]
[67310,"Sm 2","Peter","Roland","MC Möve Cuxhaven","Ja","","","","",""]
[19228,"Sm 2","Karlheinz","Roller","1. MGC Metzingen e.V.","","","","","",""]
[42632,"Sm 1","Joachim","Romano","1. BGC Bad Füssing e.V.","","","","","",""]
[65875,"Jw","Yelyzaveta","Romanyak","BGC Leipzig","","","","","",""]
[34766,"D","Yvonne","Romberg","MGC Freizeitzentrum Biebertal","","","","","",""]
[44981,"Sm 1","Michael","Romberg","MGC Freizeitzentrum Biebertal","","","","","",""]
[6616,"Sm 2","Wolfgang","Romberg","BGC Schloß Paffendorf e.V.","","","","","",""]
[25686,"Sw 2","Silvia","Romberg","BGC Schloß Paffendorf e.V.","","","","","",""]
[37427,"Sm 1","Stephan","Römer","SSC Halver e.V.","","","","","",""]
[16911,"H","Wolfgang","Romero","MSC Bad Godesberg e.V.","","","","","",""]
[63238,"Sw 2","Anneliese","Roosmann-Diecks","BGC Bremen","Ja","","","","",""]
[24416,"Sm 2","Martin","Rösch","1. NMC Kelheim e.V.","","","","","",""]
[28305,"Sm 2","Andreas","Rösch","MGF 77 Sickenhausen e.V.","","","","","",""]
[38635,"H","Benjamin","Rose","BGC Dormagen e.V.","","","","","",""]
[65915,"Sm 2","Karl-Wilhelm","Rose","BGC Dormagen e.V.","","","","","",""]
[38636,"Sw 2","Heidemarie","Rose","BGC Dormagen e.V.","","","","","",""]
[35849,"H","Christian","Roselieb","BGC Wolfsburg","Ja","","","","",""]
[35850,"Sm 2","Manfred","Roselieb","MGC Göttingen","Ja","13949","X","","",""]
[35560,"Sm 1","Axel","Rosemann","Minigolfunion Neviges-Odenthal 1968 e.V.","","","","","",""]
[33650,"D","Marina","Rosenbach","MGC Traben-Trarbach","","","","","",""]
[38213,"Sm 2","Uwe","Rosenbaum","MGF Magdeburg 1995 e.V.","","","","","",""]
[66634,"Sm 2","Willi","Rosenberger","MSV Würzburg-Löwenbrücke e.V.","","","","","",""]
[29032,"Sm 1","Detlev","Rösener","MSK Neheim-Hüsten e.V.","","","","","",""]
[3522,"Sw 2","Ingeborg","Rosenkranz","OMGC Ingolstadt e.V.","","","","","",""]
[36949,"Sm 2","Roland","Rösner","MSK Olching e.V.","","","","","",""]
[31044,"H","Markus","Roßmeier","1. BGC Bad Füssing e.V.","","","","","",""]
[67414,"H","Stefan","Rotenstein","MGC Peine","Ja","","","","",""]
[66952,"Jw","Marie Sophie","Rotermund","BGC Celle","Ja","","","","",""]
[38248,"Sm 2","Jürgen","Rotermund","VfL Lüneburg","Ja","","","","",""]
[66992,"H","Frank","Roth","1. BGC Rodalben 1977 e.V.","","","","","",""]
[37019,"D","Nathalie-Inez","Roth","TG Höchberg von 1862 Bahnengolf e.V.","","","","","",""]
[66880,"Schm","Noah","Roth","1. BGC Rodalben 1977 e.V.","","","","","",""]
[34054,"Sm 2","Dieter","Rothermel","MSC Bensheim-Auerbach e.V.","","","","","",""]
[34053,"Sw 2","Ute","Rothermel","MSC Bensheim-Auerbach e.V.","","","","","",""]
[67000,"Schm","Timo","Rotzal","TSV Pfungstadt Abt. Bahnengolf e.V.","","","","","",""]
[66908,"H","Sebastian","Rübner","MGC \"Stahlquelle\" Bad Bocklet","","","","","",""]
[66803,"Sm 1","Dietmar","Ruck","BGC Schweinfurt e.V.","","","","","",""]
[27788,"H","Sven","Rücker","MGC Wetzlar e.V.","","","","","",""]
[66287,"D","Verena","Rude","1. MGC Ladenburg e.V.","","","","","",""]
[24182,"Sm 1","Dieter","Rude","1. MGC Ladenburg e.V.","","","","","",""]
[36630,"Sm 2","Hans","Ruder","Minigolf Wölfe Rheinstetten 02","","","","","",""]
[42717,"Sm 1","Thomas","Ruff","MGC Ravensburg-Weingarten e.V.","","","","","",""]
[51306,"H","Wolfgang","Ruft","BGC Hannover","Ja","","","","",""]
[67341,"Schw","Lisa","Ruft","BGC Hannover","Ja","","","","",""]
[22305,"Sm 2","Klaus","Rüger","BGC Northeim","Ja","","","","",""]
[21226,"Sm 2","Dieter","Rüger","1. MSC Wesel 6.6.1966 e.V.","","","","","",""]
[36047,"Sm 2","Karl-Heinz","Rühle","MGC Wolnzach e.V.","","","","","",""]
[66318,"H","Christian","Rümmele","1. MGC Metzingen e.V.","","","","","",""]
[37637,"D","Anna","Rümmelin","BSV Inzlingen 1979 e.V.","","","","","",""]
[67225,"Sw 1","Eycke","Rümmelin","BSV Inzlingen 1979 e.V.","","","","","",""]
[62538,"Sw 2","Anneliese","Runge","1. MGC Saar 68 St. Ingbert e.V.","","","","","",""]
[66925,"H","Florian","Rungenhagen","BGV Bergisch Land 1962 / 63 e.V.","","","","","",""]
[49432,"H","Jürgen","Rupp","MGC Ravensburg-Weingarten e.V.","","","","","",""]
[66956,"Sw 2","Petra","Rupp","1. MGC Mainz e.V.","","","","","",""]
[6727,"Sm 2","Eberhard","Rüppel","MGC Bad Homburg vdH e.V.","","","","","",""]
[29657,"Sm 1","Frank","Rüter","MSK Neheim-Hüsten e.V.","","","","","",""]
[65913,"Sm 2","Holger","Ruzicka","BGC Illertissen e.V.","","","","","",""]
[36288,"H","Patrick","Saar","1. MGC Tuttlingen e.V.","","","","","",""]
[67228,"H","Heiko","Saathoff","BGC Bad Nenndorf","Ja","","","","",""]
[31240,"Sw 1","Petra","Sabath","MGC Einbeck","Ja","","","","",""]
[43142,"Sm 2","Wolfgang","Sachs","MGC Bad Salzuflen e.V.","","","","","",""]
[67074,"H","Torsten","Sachse","SG Arheilgen Abt. Bahnengolf","","","","","",""]
[67072,"Schm","Thilo","Sachse","SG Arheilgen Abt. Bahnengolf","","","","","",""]
[29035,"Sm 1","Markus","Sack","MSK Neheim-Hüsten e.V.","","","","","",""]
[66465,"Sm 2","Armin","Sadowski","Bochumer Minigolf-Club 1960 e.V.","","","","","",""]
[28574,"Sm 1","Bernd","Sadzeck","1. MSC Hamburg-Neu Wulmstorf","","","","","",""]
[66088,"Jw","Ellen","Saft","MSK Olching e.V.","","","","","",""]
[66089,"Jw","Chiana","Saft","MSK Olching e.V.","","","","","",""]
[37428,"Sw 1","Martina","Sagemühl-Römer","SSC Halver e.V.","","","","","",""]
[66320,"Sw 1","Petra","Sakulski","SSC Attendorn e.V.","","","","","",""]
[47016,"Sm 2","Kilian","Salch","BGC Bad Mergentheim e.V.","","","","","",""]
[45743,"Sm 1","Henri","Salewski","Bochumer Minigolf-Club 1960 e.V.","","","","","",""]
[33791,"Sm 2","Reiner","Salzmann","MSC Bad Godesberg e.V.","","","","","",""]
[6140,"Sm 2","Wilhelm","Sänger","SV 1890 e.V. Dreieichenhain, Abt. Bahnengolf","","","","","",""]
[33349,"Sm 1","Ralph","Santen","Preetzer TSV von 1861 e.V. Abt. Minigolf","","","","","",""]
[4382,"Sm 2","Matthias","Sapec","SSV Ulm 1846 Abt. Bahnengolf","","","","","",""]
[66760,"Sm 1","Turan","Sariefe","MGC Ingolstadt e.V.","","","","","",""]
[6664,"Sm 2","Manfred","Sassenberg","1. MGC Mainz e.V.","","","","","",""]
[66120,"H","Michael","Sattler","BGSV Bad Homburg","","","","","",""]
[29845,"Sm 1","Albert","Sauer","BSV 82 Ohlsbach e.V.","","","","","",""]
[49737,"H","Kay","Sauerland","MGC Harrislee-Wassersleben","","","","","",""]
[43149,"Sm 1","Ralf","Sawartowski","MGC Rot-Weiß Wanne-Eickel e.V.","","","","","",""]
[65989,"Jm","Sadettin","Saykin","MGC Bad Soden-Salmünster","","","","","",""]
[65984,"Sm 1","Sadiddin","Saykin","MGC Bad Soden-Salmünster","","","","","",""]
[30667,"Sm 1","Jens","Schacht","Hamburger MC von 1965 e.V.","","","","","",""]
[40098,"Sw 1","Monika","Schacht","MGC Harrislee-Wassersleben","","","","","",""]
[67049,"Sm 1","Frank","Schachtsiek","Bochumer Minigolf-Club 1960 e.V.","","","","","",""]
[12064,"Sm 2","Egon","Schacke","MSV Berliner Bär e.V.","","","","","",""]
[36767,"Sw 2","Doris","Schacke","MSV Berliner Bär e.V.","","","","","",""]
[34164,"Sm 1","Klaus","Schade","MGC Heringen 1997 e.V.","","","","","",""]
[44021,"Sm 1","Michael","Schaefer","MSC Bad Godesberg e.V.","","","","","",""]
[37818,"H","Pascal","Schäfer","MGC Traben-Trarbach","","","","","",""]
[31511,"H","Willi","Schäfer","MSF Brilon e.V.","","","","","",""]
[66150,"Jm","Dennis","Schäfer","MSC Bensheim-Auerbach e.V.","","","","","",""]
[24462,"Sm 1","Jürgen","Schäfer","MGC Rot-Weiß Wanne-Eickel e.V.","","","","","",""]
[26580,"Sm 1","Norbert","Schäfer","MGC Wuppertal-Ronsdorf 1967 e.V.","","","","","",""]
[27438,"Sm 1","Armin","Schäfer","MSC Herscheid 1963 e.V.","","","","","",""]
[1814,"Sm 2","Norbert","Schäfer","MGC Kassel","Ja","3378","X","","",""]
[49087,"Sm 2","Richard","Schäfer","1. MGC Mainz e.V.","","","","","",""]
[19572,"Sm 2","Achim","Schäfer","MGC Wuppertal-Ronsdorf 1967 e.V.","","","","","",""]
[22141,"Sm 2","Manfred","Schäfer","MSC Herscheid 1963 e.V.","","","","","",""]
[66231,"Sm 2","Manfred","Schäfer","BGC Hamm 1959 e.V.","","","","","",""]
[66230,"Sw 2","Gabriele","Schäfer","BGC Hamm 1959 e.V.","","","","","",""]
[45844,"H","Carsten","Schakowski","MGC Monrepos e.V.","","","","","",""]
[26089,"Sm 2","Albert","Schamberger","MSK Olching e.V.","","","","","",""]
[26088,"Sw 2","Gerda","Schamberger","MSK Olching e.V.","","","","","",""]
[66787,"Sm 1","Sven","Schäning","MGC Göttingen","Ja","","","","",""]
[67243,"Sw 1","Petra","Schäning","MGC Göttingen","Ja","","","","",""]
[66792,"H","Kevin","Schank","1. MGC Oberthal e.V.","","","","","",""]
[6642,"Sm 2","Erich","Schankweiler","VfL Lüneburg","Ja","","","","",""]
[46517,"Sm 1","Thomas","Schäpe","BGSV Kerpen e.V.","","","","","",""]
[5062,"Sm 2","Dirk","Schaper","BGC Hannover","Ja","","","","",""]
[7907,"Sm 2","Peter","Scharfenberg","MSC Bad Godesberg e.V.","","","","","",""]
[38455,"Sw 1","Helga","Scharnhorst","BGC Hannover","Ja","26907","X","","",""]
[1549,"Sm 2","Rüdiger","Scharnhorst","BGC Hannover","Ja","3113","X","","",""]
[67147,"Sw 1","Sabine","Scharpe","Bochumer Minigolf-Club 1960 e.V.","","","","","",""]
[66599,"Sm 2","Heinz","Scharvier","SC Wermelskirchen 1976 e.V.","","","","","",""]
[67356,"Schm","Lino","Schasse","BSV 86 München e.V.","","","","","",""]
[67357,"Schm","Mika","Schasse","BSV 86 München e.V.","","","","","",""]
[27121,"Sm 2","Arno","Schatke","SV Gebhardshagen","Ja","8146","X","","",""]
[34453,"Sm 2","Michael","Schätz","1. MGC Mannheim 1968 e.V.","","","","","",""]
[35464,"D","Susanne","Schaub","MSV Würzburg-Löwenbrücke e.V.","","","","","",""]
[66477,"Schm","Karim","Schaub","MSV Würzburg-Löwenbrücke e.V.","","","","","",""]
[40975,"Sm 1","Werner","Schechinger","MGC Wolnzach e.V.","","","","","",""]
[66526,"Jw","Laura","Scheder","TG Höchberg von 1862 Bahnengolf e.V.","","","","","",""]
[66525,"Sm 1","Roland","Scheder","TG Höchberg von 1862 Bahnengolf e.V.","","","","","",""]
[66524,"Sw 1","Christine","Scheder","TG Höchberg von 1862 Bahnengolf e.V.","","","","","",""]
[33583,"H","Jens","Scheffler","1. BGC Wesseling 1975 e.V.","","","","","",""]
[65969,"Sw 2","Ingelore","Scheffler","SC Bad Münder","Ja","","","","",""]
[36185,"Sm 1","Christian","Scheffner","MV Lankwitzer Dragons","","","","","",""]
[36181,"Sw 1","Kathrin","Scheffner","MV Lankwitzer Dragons","","","","","",""]
[47093,"H","Christian","Scheider","SSC Halver e.V.","","","","","",""]
[24,"Sm 1","Stefan","Scheider","SSC Halver e.V.","","","","","",""]
[34772,"H","Dirk","Scheikowski","1. MSC Wesel 6.6.1966 e.V.","","","","","",""]
[66942,"H","Dominik","Schellewald","MGC Kassel","Ja","","","","",""]
[631,"Sm 2","Kurt","Schellhas","MGC \"AS\" Witten 1963 e.V.","","","","","",""]
[66598,"H","Nico","Schenk","MGC Bad Feilnbach e.V.","","","","","",""]
[44026,"Sm 2","Horst-Dieter","Schenk","1. MGC Köln 1961 e.V.","","","","","",""]
[62802,"Sw 2","Linda","Schenk","Freizeit Club Bliesen e.V.","","","","","",""]
[66951,"Sm 2","Richard","Schenkel","MSC Bensheim-Auerbach e.V.","","","","","",""]
[38547,"H","Peter","Scherber","MGC \"Stahlquelle\" Bad Bocklet","","","","","",""]
[36164,"Sm 1","Markus","Scherkenbach","VfM Bottrop e.V.","","","","","",""]
[44856,"Sm 1","Irving","Scheunemann","MC Möve Cuxhaven","Ja","","","","",""]
[65902,"D","Andrea","Schewcik","MC Ilvesheim e.V.","","","","","",""]
[65901,"Sm 1","Andreas","Schewcik","MC Ilvesheim e.V.","","","","","",""]
[30366,"Sm 1","Ralf","Schewerda","MGC Felderbachtal 1964 e.V.","","","","","",""]
[18086,"Sm 2","Hans","Schewerda","1. MGC Gelsenkirchen e.V.","","","","","",""]
[18085,"Sw 2","Helga","Schewerda","1. MGC Gelsenkirchen e.V.","","","","","",""]
[45472,"Sm 1","Thomas","Schiebel","1. MGC Mainz e.V.","","","","","",""]
[37451,"Sm 2","Wolfgang","Schieblich","SG  Weiterstadt 1886 e.V.","","","","","",""]
[67343,"Jm","Marvin","Schienbein","MGC Kassel","Ja","","","","",""]
[67342,"Jw","Luisa","Schienbein","MGC Kassel","Ja","","","","",""]
[29002,"Sw 1","Charlotte","Schierding","2. MGC Worms","","","","","",""]
[67324,"Schw","Sara","Schieren","BSC Ennepetal e.V.","","","","","",""]
[66772,"D","Angela","Schikorra","BGSV Castrop e.V. 1961","","","","","",""]
[47492,"Sm 1","Markus","Schild","MGC Schwaikheim e.V.","","","","","",""]
[66246,"Sm 1","Norbert","Schildan","MGC Bergisch Gladbach Gierath e.V.","","","","","",""]
[66294,"Sm 2","Werner","Schilitz","MSV Bad Kreuznach","","","","","",""]
[41116,"Sm 1","Alfred","Schiller","1. BGC Bad Füssing e.V.","","","","","",""]
[66653,"H","Jan-Rainer","Schilling","VfL Lüneburg","Ja","","","","",""]
[17470,"Sm 2","Emil","Schilling","1. MGC Mannheim 1968 e.V.","","","","","",""]
[5665,"Sm 2","Adolf","Schilling","1. MSC Wesel 6.6.1966 e.V.","","","","","",""]
[67041,"Sm 1","Arno","Schimanski","MGC Rot-Weiß Wanne-Eickel e.V.","","","","","",""]
[46946,"Sm 1","Stefan","Schimscha","1. FMGC Lichtenfels 1961 e.V.","","","","","",""]
[34905,"H","Sebastian","Schindler","MGV Eibenstock","","","","","",""]
[29859,"Sm 1","Ralf","Schindler","BGC Celle","Ja","","","","",""]
[26183,"Sm 2","Uwe","Schirrmacher","1. MSC Hamburg-Neu Wulmstorf","","","","","",""]
[38053,"Sw 2","Suse","Schiwek","1. MGC Köln 1961 e.V.","","","","","",""]
[66252,"Sw 1","Simone","Schlabbach","SG  Weiterstadt 1886 e.V.","","","","","",""]
[36672,"H","Thomas","Schlai","BGC Illertissen e.V.","","","","","",""]
[63701,"H","Dominik","Schlauch","BGC Bad Berneck e.V.","","","","","",""]
[26002,"Sm 1","Peter","Schlauch","BGC Bad Berneck e.V.","","","","","",""]
[26005,"Sw 2","Anna-Maria","Schlauch","BGC Bad Berneck e.V.","","","","","",""]
[66312,"Jw","Jeanine","Schlaucher","MGC Murnau am Staffelsee e.V.","","","","","",""]
[44479,"Sw 1","Vera","Schlaudecker","1. KC Homburg-Saar 1967 e.V.","","","","","",""]
[62840,"Sm 2","Gerd","Schlaudecker","1. MGC Saar 68 St. Ingbert e.V.","","","","","",""]
[65959,"Sm 1","Christian","Schlegel","VFB 21 Neugattersleben e. V.","","","","","",""]
[38217,"D","Melanie","Schleich","MSF Brilon e.V.","","","","","",""]
[38649,"D","Christina","Schleich","MSF Brilon e.V.","","","","","",""]
[38218,"Sm 2","Peter","Schleich","MSF Brilon e.V.","","","","","",""]
[17448,"Sm 2","Manfred","Schleier","1. BGC München e.V.","","","","","",""]
[18146,"Sm 2","Wolfgang","Schlenstedt","Minigolf Wölfe Rheinstetten 02","","","","","",""]
[34033,"Sw 1","Annette","Schlereth","MGC \"Stahlquelle\" Bad Bocklet","","","","","",""]
[37858,"H","Sebastian","Schleser","1. MGC München-Feldmoching e.V.","","","","","",""]
[42041,"Sm 2","Klaus","Schleser","1. MGC München-Feldmoching e.V.","","","","","",""]
[66966,"H","Fabian","Schlesier","BGC Hannover","Ja","29353","X","","",""]
[3738,"Sm 2","Peter","Schlesinger","Bochumer Minigolf-Club 1960 e.V.","","","","","",""]
[67212,"Sm 1","Peter","Schlicksupp","MGC Bad Homburg vdH e.V.","","","","","",""]
[29721,"Sm 1","Rainer","Schlieker","MGC Murnau am Staffelsee e.V.","","","","","",""]
[21326,"Sm 2","Hans-Günter","Schlösser","BGSV Kerpen e.V.","","","","","",""]
[43245,"Sm 1","Rainer","Schlottermüller","BGC Hannover","Ja","","","","",""]
[36394,"Sm 2","Wilfried","Schlüter","VfB Osnabrück e.V.","","","","","",""]
[67178,"Sm 1","Joachim","Schmäck","1.KGC Mönchengladbach e.V.","","","","","",""]
[67177,"Sw 1","Birgit","Schmäck","1.KGC Mönchengladbach e.V.","","","","","",""]
[67060,"Sm 1","Herbert","Schmalix","1. Münchener MGC e.V.","","","","","",""]
[35113,"H","Markus","Schmälzle","Miniaturgolf Sportclub Schriesheim e.V","","","","","",""]
[66742,"Jm","Kenny Marc","Schmeckenbecher","MC 62 Lüdenscheid e.V.","","","","","",""]
[38137,"Sm 1","Thomas","Schmeier","MGF Magdeburg 1995 e.V.","","","","","",""]
[203,"Sm 1","Michael","Schmeling","Tempelhofer MV Berlin e.V.","","","","","",""]
[25894,"Sm 1","Roland","Schmid","MGF Hilzingen 80 e.V.","","","","","",""]
[67080,"Sm 1","Stephan","Schmid","OMGC Ingolstadt e.V.","","","","","",""]
[67189,"Sm 1","Manfred ","Schmid","MGF Steinbruch Kempten","","","","","",""]
[67190,"Sw 1","Sibylle","Schmid","MGF Steinbruch Kempten","","","","","",""]
[2334,"Sm 2","Walter","Schmid","Miniaturgolf Sportclub Schriesheim e.V","","","","","",""]
[40400,"Sw 2","Barbara","Schmid","TV Niederstetten 1862 e.V.  Abt. Minigolf","","","","","",""]
[67081,"Sw 1","Margit","Schmidbauer","OMGC Ingolstadt e.V.","","","","","",""]
[67082,"Sm 2","Werner","Schmidbauer","OMGC Ingolstadt e.V.","","","","","",""]
[64760,"H","Maximilian","Schmidhuber","1. BGC Landshut e.V.","","","","","",""]
[42558,"Sm 1","Lothar","Schmidhuber","1. BGC Landshut e.V.","","","","","",""]
[66810,"H","Mirko","Schmidt","MGF Magdeburg 1995 e.V.","","","","","",""]
[66256,"H","Maximilian","Schmidt","1. FMGC Lichtenfels 1961 e.V.","","","","","",""]
[37848,"H","Dustin","Schmidt","MGC Homburger Land e.V.","","","","","",""]
[37849,"H","Marvin","Schmidt","MGC Homburger Land e.V.","","","","","",""]
[33928,"H","Thorben","Schmidt","MGC Brunsbüttel e.V.","","","","","",""]
[67140,"Jw","Sophie","Schmidt","PTSV Hof, Abt. Minigolf ","","","","","",""]
[66761,"Jw","Hanna","Schmidt","CGC Rauschenberg e.V.","","","","","",""]
[67159,"Schw","Leonie","Schmidt","BGC Bremen","Ja","","","","",""]
[35706,"Sm 1","Peter","Schmidt","MGV Eibenstock","","","","","",""]
[30657,"Sm 1","Volker","Schmidt","1. MGC Mitterteich-Großbüchlberg","","","","","",""]
[66746,"Sm 1","Udo","Schmidt","Biskirchener BGV e.V.","","","","","",""]
[22105,"Sm 1","Frank","Schmidt","MC Neuwied","","","","","",""]
[26491,"Sm 1","Olaf","Schmidt","MGC \"AS\" Witten 1963 e.V.","","","","","",""]
[40202,"Sm 1","Helmut","Schmidt","MGC Freizeitzentrum Biebertal","","","","","",""]
[51714,"Sm 1","Christian","Schmidt","BGSC \"Gut Schlag\" Gladbeck e.V.","","","","","",""]
[65917,"Sm 1","Lars","Schmidt","BSC Ennepetal e.V.","","","","","",""]
[45345,"Sw 1","Barbara","Schmidt","1. MGC Mitterteich-Großbüchlberg","","","","","",""]
[30937,"Sw 1","Heike","Schmidt","BGC Bad Nenndorf","Ja","","","","",""]
[67275,"Sm 2","Peter","Schmidt","BSG Pneumant Fürstenwalde e.V., Abt. Minigolf","","","","","",""]
[40892,"Sm 2","Horst","Schmidt","BGC Hannover","Ja","16653","","X","","X"]
[9197,"Sm 2","Hans-Jürgen","Schmidt","MGC Homburger Land e.V.","","","","","",""]
[43009,"Sm 2","Sigurd","Schmidt","MGC Bad Oldesloe e.V.","","","","","",""]
[19792,"Sm 2","Dietmar","Schmidt","BIG ASPERG e.V.","","","","","",""]
[36324,"Sw 2","Carmen","Schmidt","BGC Hannover","Ja","","","","",""]
[67258,"Sw 2","Silvia","Schmidt","1. MGC Mannheim 1968 e.V.","","","","","",""]
[31210,"Sm 1","Ralf","Schmidt-Hess","MGF Waldshut 74 e.V.","","","","","",""]
[36631,"Sw 1","Sabine","Schmidt-Hess","1. CGC Blau-Gelb Grötzingen","","","","","",""]
[5056,"Sm 2","Johannes","Schmiedbauer","1. BGC Bad Füssing e.V.","","","","","",""]
[36110,"H","Michael","Schmitt","SG Arheilgen Abt. Bahnengolf","","","","","",""]
[65889,"H","Benjamin","Schmitt","MGC Kassel","Ja","","","","",""]
[33891,"Sm 1","Uwe","Schmitt","Miniaturgolf Sportclub Schriesheim e.V","","","","","",""]
[44955,"Sm 1","Jürgen","Schmitt","MGC \"AS\" Witten 1963 e.V.","","","","","",""]
[46967,"Sw 1","Regina","Schmitt","BGC Uerdingen e.V.","","","","","",""]
[60743,"Sw 2","Ursula","Schmitt","SG Arheilgen Abt. Bahnengolf","","","","","",""]
[36041,"Sm 1","Joachim","Schmittdiel","MGC Kassel","Ja","","","","",""]
[34109,"Sw 1","Karin","Schmitutz","MGC Millennium Lorsch e.V.","","","","","",""]
[9449,"Sm 2","Peter","Schmitutz","MGC Millennium Lorsch e.V.","","","","","",""]
[23979,"Sw 2","Gabriela","Schmitutz-Krause","MGC Millennium Lorsch e.V.","","","","","",""]
[67001,"H","Dominik","Schmitz","Kölner Miniatur Golf Club e.V.","","","","","",""]
[38245,"Sw 1","Sibylle","Schmitz","BGC Dormagen e.V.","","","","","",""]
[37171,"Sw 2","Ingeborg","Schmitz","BGC Assindia Essen e.V.","","","","","",""]
[35141,"H","Tobias","Schmolke","MSC Bensheim-Auerbach e.V.","","","","","",""]
[756,"Sm 2","Axel Rolf","Schmurdy","MGC Kassel","Ja","2321","X","","",""]
[24639,"H","Nico","Schnauer","MGC Bad Oldesloe e.V.","","","","","",""]
[64054,"Sm 1","Reinhold","Schneid","MGV Ansbach e.V.","","","","","",""]
[34319,"H","Alexander","Schneider","SG Arheilgen Abt. Bahnengolf","","","","","",""]
[36247,"H","Andreas","Schneider","SG Arheilgen Abt. Bahnengolf","","","","","",""]
[66665,"H","Markus","Schneider","SG Arheilgen Abt. Bahnengolf","","","","","",""]
[67297,"Sm 1","Olaf","Schneider","MGF Steinbruch Kempten","","","","","",""]
[66666,"Sm 1","Timm","Schneider","SG Arheilgen Abt. Bahnengolf","","","","","",""]
[43681,"Sm 1","Christian","Schneider","MGC Göttingen","Ja","","","","",""]
[43733,"Sm 1","Simon","Schneider","BGV Bergisch Land 1962 / 63 e.V.","","","","","",""]
[66941,"Sm 1","Dirk","Schneider","1. BGC Paderborn e.V.","","","","","",""]
[40365,"Sw 1","Renate","Schneider","OMGC Ingolstadt e.V.","","","","","",""]
[66818,"Sm 2","Franz","Schneider","BSV 82 Ohlsbach e.V.","","","","","",""]
[61696,"Sm 2","Paul","Schneider","1. MGC Ludwigshafen e.V.","","","","","",""]
[61501,"Sm 2","Bernhard","Schneider","MPF Hardt e.V.","","","","","",""]
[28127,"Sm 2","Wolfgang","Schneiderbanger","1. MGC Bamberg e.V.","","","","","",""]
[67115,"Sm 1","Michael","Schnell","BSV 82 Ohlsbach e.V.","","","","","",""]
[47187,"Sm 1","Oliver","Schnickmann","KSV Baltrum e.V.","","","","","",""]
[47186,"Sw 1","Stefanie","Schnickmann","KSV Baltrum e.V.","","","","","",""]
[43936,"Sm 1","Martin","Schnittker","Bochumer Minigolf-Club 1960 e.V.","","","","","",""]
[66214,"Sm 1","Jörg","Schnoor","MGC Bad Oldesloe e.V.","","","","","",""]
[67367,"Sm 2","Norbert","Schnura","Tempelhofer MV Berlin e.V.","","","","","",""]
[67368,"Sw 2","Regina","Schnura","Tempelhofer MV Berlin e.V.","","","","","",""]
[37048,"Sm 1","Manfred","Schöbel","HMC Büttgen e.V.","","","","","",""]
[67182,"Sm 2","Rudolf","Schocher","Minigolf-Club Diessen","","","","","",""]
[40386,"Sm 1","Thomas","Schöchlin","MSV Würzburg-Löwenbrücke e.V.","","","","","",""]
[67359,"H","Kurt","Schöllnast","BSV 86 München e.V.","","","","","",""]
[66299,"H","Bastian","Scholz","TG Höchberg von 1862 Bahnengolf e.V.","","","","","",""]
[31280,"H","Lucas","Scholz","1. MGC Mainz e.V.","","","","","",""]
[12780,"Sm 2","Rüdiger","Scholz","MSK Neheim-Hüsten e.V.","","","","","",""]
[24611,"Sm 2","Renaldo","Scholz","BGC Dormagen e.V.","","","","","",""]
[67261,"Sm 1","Rainer","Schölzke","MGC \"Stahlquelle\" Bad Bocklet","","","","","",""]
[35267,"Sm 2","Helmut","Schön","MC Ilvesheim e.V.","","","","","",""]
[35230,"Sm 2","Wolfgang","Schön","SC Gut Heil Neumünster e.V.","","","","","",""]
[34084,"Sm 1","Karl-Heinz","Schönfeld","VfL Lüneburg","Ja","","","","",""]
[3389,"Sm 2","Horst","Schönfeld","BGC Northeim","Ja","","","","",""]
[50889,"Sw 1","Ute","Schönherr","1. MGC Köln 1961 e.V.","","","","","",""]
[31659,"Sm 1","Uwe","Schonz","MC Tigers Künsebeck","","","","","",""]
[44002,"Sw 1","Jutta","Schöpf","BGC Bad Berneck e.V.","","","","","",""]
[67302,"Schm","Melvin-Roy","Schöpfer","MGC Bad Salzuflen e.V.","","","","","",""]
[22686,"Sm 1","Marc","Schöpper","BGSV Kerpen e.V.","","","","","",""]
[66449,"Jm","Lukas","Schrader","MGC Olympia Kiel e.V.","","","","","",""]
[44645,"Sm 2","Reiner","Schramm","BGSV Bad Homburg","","","","","",""]
[41008,"H","Andreas","Schreck","VfM e.V. Berlin ","","","","","",""]
[66804,"Jm","Clemens","Schreiber","BGC Wolfsburg","Ja","","","","",""]
[67296,"Sw 1","Martina","Schreiber","MGC Bad Soden-Salmünster","","","","","",""]
[67269,"Sm 2","Lutz","Schreiber","BSG Pneumant Fürstenwalde e.V., Abt. Minigolf","","","","","",""]
[67295,"Sm 2","Manfred","Schreiber","MGC Bad Soden-Salmünster","","","","","",""]
[66205,"Sm 2","Udo","Schreiber","1. MGC Epe 1978 e.V.","","","","","",""]
[66248,"H","Patrick","Schreiter","BGS Hardenberg-Pötter e.V.","","","","","",""]
[66249,"H","Sebastian","Schreiter","BGS Hardenberg-Pötter e.V.","","","","","",""]
[38343,"H","Christopher","Schrettl","BGC Neutraubling e.V.","","","","","",""]
[49424,"Sm 1","Thomas","Schrettl","BGC Neutraubling e.V.","","","","","",""]
[67105,"Sm 1","Harald","Schreyl","MGC Wolnzach e.V.","","","","","",""]
[66660,"Sm 1","Sebastien","Schrobiltgen","BGS Hardenberg-Pötter e.V.","","","","","",""]
[38657,"Sm 2","Gerhard","Schröck","BGC Schweinfurt e.V.","","","","","",""]
[34660,"H","Jan-Georg","Schröder","MC Flora Elmshorn e.V.","","","","","",""]
[66833,"Sm 1","Mario","Schröder","1. Berliner Miniaturgolf-Sportclub e.V. 1960","","","","","",""]
[40350,"Sm 1","Matthias","Schröder","MGC Dormagen-Brechten e.V.","","","","","",""]
[66602,"Sm 1","Jürgen","Schröder","1. MSC Wesel 6.6.1966 e.V.","","","","","",""]
[67387,"Sw 1","Manuela","Schröder","VfL Lohbrügge Abt. Bahnengolf","","","","","",""]
[66839,"Sw 1","Michaela","Schröder","MGC Bad Salzuflen e.V.","","","","","",""]
[3476,"Sm 2","Ulrich","Schröder","1. Berliner Miniaturgolf-Sportclub e.V. 1960","","","","","",""]
[36274,"Sm 2","Jürgen","Schröder","SSC Halver e.V.","","","","","",""]
[4054,"Sw 2","Gabriele","Schröder","1. Berliner Miniaturgolf-Sportclub e.V. 1960","","","","","",""]
[65958,"H","Marco","Schrödl","VFB 21 Neugattersleben e. V.","","","","","",""]
[26346,"Sm 1","Michael","Schröter","Reinickendorfer MGC e.V.","","","","","",""]
[66827,"Schm","Jarno","Schrüfer","TSV Pfungstadt Abt. Bahnengolf e.V.","","","","","",""]
[38400,"H","Marc","Schub","MSK Olching e.V.","","","","","",""]
[30765,"H","Marcel","Schubbe","Reinickendorfer MGC e.V.","","","","","",""]
[65979,"H","Niklas","Schubert","MGC Bad Salzuflen e.V.","","","","","",""]
[65980,"Jm","Finn","Schubert","MGC Bad Salzuflen e.V.","","","","","",""]
[31091,"Sm 1","Christian","Schubert","1. NMC Kelheim e.V.","","","","","",""]
[66632,"Sw 1","Christiane","Schubert","MGC Bergisch Gladbach Gierath e.V.","","","","","",""]
[6795,"Sm 2","Horst","Schuchardt","BGC Bremen","Ja","","","","",""]
[31757,"H","Torsten","Schück","1. MGC Mainz e.V.","","","","","",""]
[29088,"H","Bernd","Schué","BGC Goslar","Ja","","","","",""]
[26338,"Sw 1","Sabine-Simone","Schüler","1. MGC Bamberg e.V.","","","","","",""]
[66081,"Jm","Christoph","Schuller","MSK Olching e.V.","","","","","",""]
[66082,"Jm","Fabian","Schuller","MSK Olching e.V.","","","","","",""]
[46043,"H","Jens","Schüller","MGC Bergisch Gladbach Gierath e.V.","","","","","",""]
[67125,"D","Dana","Schüller","BGSV Kerpen e.V.","","","","","",""]
[40246,"H","Jan","Schulte","SSC Attendorn e.V.","","","","","",""]
[37834,"Sm 1","Udo","Schulte","VfB Osnabrück e.V.","","","","","",""]
[66898,"Sm 2","Michael","Schulte","BV Sennestadt","","","","","",""]
[67286,"Sm 1","Christian","Schultes","MSK Olching e.V.","","","","","",""]
[67116,"H","Benjamin","Schultheiss","SG Arheilgen Abt. Bahnengolf","","","","","",""]
[31848,"Sm 1","Ralf","Schulz","MC Möve Cuxhaven","Ja","","","","",""]
[43682,"Sm 1","Matthias","Schulz","MGC Göttingen","Ja","18132","","X","",""]
[45666,"Sm 1","Hans-Jürgen","Schulz","MC Möve Cuxhaven","Ja","","","","",""]
[38181,"Sm 2","Peter","Schulz","SV Lurup Abt. Bahnengolf","","","","","",""]
[6329,"Sw 2","Hildegard","Schulz","1. MC Weinheim e.V.","","","","","",""]
[66936,"Jm","Jonas","Schulze","1. MSC Hamburg-Neu Wulmstorf","","","","","",""]
[66654,"Sm 2","Ralf","Schulze","TSV Arendsee e.V.","","","","","",""]
[48074,"Sm 2","Klaus","Schulze","MGC Dortmund Syburg e.V.","","","","","",""]
[67277,"H","Martin Christoph Benjamin","Schulze-Stapen","MGC Lippe-Detmold e.V.","","","","","",""]
[67112,"H","Danny","Schumacher","1. MGC Gelsenkirchen e.V.","","","","","",""]
[67114,"H","David","Schumacher","1. MGC Gelsenkirchen e.V.","","","","","",""]
[37475,"D","Sarah","Schumacher","MGF Hilzingen 80 e.V.","","","","","",""]
[66673,"Jm","Stefan","Schumacher","1. MGC Tuttlingen e.V.","","","","","",""]
[66672,"Schw","Silvia","Schumacher","BSV Inzlingen 1979 e.V.","","","","","",""]
[31332,"Sm 1","Wolfgang","Schumacher","BSV Inzlingen 1979 e.V.","","","","","",""]
[3386,"Sm 2","Klaus","Schumacher","Kölner Miniatur Golf Club e.V.","","","","","",""]
[49856,"Sm 2","Herbert","Schüngel","BGC Assindia Essen e.V.","","","","","",""]
[49580,"Sw 2","Petra","Schüngel","BGC Assindia Essen e.V.","","","","","",""]
[30255,"Sm 2","Herbert","Schurig jun.","VfL Lohbrügge Abt. Bahnengolf","","","","","",""]
[45028,"Sm 2","Klaus","Schürings","MGC Göttingen","Ja","18917","","","",""]
[33960,"Sw 1","Susanne","Schürmann","1. BGC Wesseling 1975 e.V.","","","","","",""]
[47009,"Sm 1","Wolfgang","Schury","BGC Bad Mergentheim e.V.","","","","","",""]
[67347,"Jw","Jana","Schüßler","MSC Bensheim-Auerbach e.V.","","","","","",""]
[23509,"H","David","Schuster","1. MGC Ludwigshafen e.V.","","","","","",""]
[38046,"Sm 1","Oliver","Schuster","BGC Oberhausen e.V.","","","","","",""]
[38154,"Sw 1","Alexandra","Schuster","BGC Oberhausen e.V.","","","","","",""]
[4645,"Sm 2","Bernhard","Schütterle","BGC Rheinau-Freistett e.V.","","","","","",""]
[37112,"H","Ronny","Schüttler","SG  Weiterstadt 1886 e.V.","","","","","",""]
[66591,"H","Philipp","Schütz","MGC Kassel","Ja","","","","",""]
[41299,"Sm 1","Rainer","Schütz","BGC Heilbronn e.V.","","","","","",""]
[32907,"Sm 2","Bernd","Schwab","SC Bad Münder","Ja","11116","","X","","X"]
[32908,"Sw 2","Marianne","Schwab","SC Bad Münder","Ja","","","","",""]
[66857,"Schm","Luca","Schwarz","Minigolfclub Karlshagen e.V.","","","","","",""]
[66470,"Schm","Tobias","Schwarz","MSK Olching e.V.","","","","","",""]
[67094,"Schm","Dominik","Schwarz","MSK Olching e.V.","","","","","",""]
[35523,"Sw 1","Rosemarie","Schwarz","MSC Bensheim-Auerbach e.V.","","","","","",""]
[2284,"Sm 2","Egon","Schwarz","Minigolfclub Karlshagen e.V.","","","","","",""]
[4629,"Sm 2","Sebastian","Schwarz","MGC Wolnzach e.V.","","","","","",""]
[49255,"Sm 2","Detlef","Schwarz","MC Möve Cuxhaven","Ja","","","","",""]
[2283,"Sw 2","Anita","Schwarz","Minigolfclub Karlshagen e.V.","","","","","",""]
[50327,"H","Tobias","Schwarzbach","MCE Sindelfingen e.V.","","","","","",""]
[5265,"Sm 2","Peter","Schwarzbach","MCE Sindelfingen e.V.","","","","","",""]
[66053,"Jm","Nils","Schwarzenberger","MGC Murnau am Staffelsee e.V.","","","","","",""]
[66616,"Schm","Marco","Schwarzer","Minigolfclub Karlshagen e.V.","","","","","",""]
[19806,"Sm 2","Ulrich","Schwebinghaus","MGC Wuppertal-Ronsdorf 1967 e.V.","","","","","",""]
[19804,"Sw 2","Bettina","Schwebinghaus","MGC Wuppertal-Ronsdorf 1967 e.V.","","","","","",""]
[23183,"Sm 2","Karl-Albert","Schweizer","1. MGC Ludwigshafen e.V.","","","","","",""]
[45141,"H","Uwe","Schwer","MC Ilvesheim e.V.","","","","","",""]
[22937,"Sm 2","Bernd","Schwer","MC Ilvesheim e.V.","","","","","",""]
[65944,"H","Benedikt","Schwickert","BSV Inzlingen 1979 e.V.","","","","","",""]
[35763,"H","Sebastian","Schwind","1. MGC Ludwigshafen e.V.","","","","","",""]
[33361,"H","Sebastian","Schwind","BGC Dormagen e.V.","","","","","",""]
[36107,"Sw 1","Regina","Schwind","BGC Dormagen e.V.","","","","","",""]
[36108,"Sm 2","Karl-Willi","Schwind","BGC Dormagen e.V.","","","","","",""]
[29873,"Sm 1","Holger","Schwingen","MGC Dormagen-Brechten e.V.","","","","","",""]
[40968,"Sm 1","Markus","Schwinger","BGSC \"Gut Schlag\" Gladbeck e.V.","","","","","",""]
[67413,"Sm 1","Stefan ","Schwinghammer","MGC Murnau am Staffelsee e.V.","","","","","",""]
[16230,"Sm 1","Thorsten","Seegert","BGC Northeim","Ja","","","","",""]
[31144,"Sm 2","Uwe","Seeland","BSC Ennepetal e.V.","","","","","",""]
[49464,"Sm 2","Norbert","Seelig","BGSC Bochum 1978 e.V.","","","","","",""]
[35801,"Sm 2","Gerald","Seher","TSV Salzgitter","Ja","","","","",""]
[66056,"H","Alexander","Sehm","MSG Kempten e.V.","","","","","",""]
[36068,"H","Michael","Seibert","MGC Ostheim / Rhön e.V.","","","","","",""]
[37395,"Sm 1","Andreas","Seidel","MV Lankwitzer Dragons","","","","","",""]
[67273,"Sm 1","Dirk","Seidel","BSG Pneumant Fürstenwalde e.V., Abt. Minigolf","","","","","",""]
[50389,"Sm 1","Martin","Seidel","MGC putter Künzell 1970 e.V.","","","","","",""]
[66621,"Sm 2","Heribert","Seidl","BGC Neutraubling e.V.","","","","","",""]
[50138,"H","Frank","Seidler","BGSV Kerpen e.V.","","","","","",""]
[65912,"Sm 2","Franz","Seifermann","1. MGC Mannheim 1968 e.V.","","","","","",""]
[66364,"Jm","Noah","Seifert","1. MSC Wesel 6.6.1966 e.V.","","","","","",""]
[66819,"Jm","Colin","Seifert","1. MSC Wesel 6.6.1966 e.V.","","","","","",""]
[66472,"Sm 1","Stefan","Seifert","1. MSC Wesel 6.6.1966 e.V.","","","","","",""]
[67133,"Sm 2","Uwe","Seifert","MSK Olching e.V.","","","","","",""]
[46233,"Sm 1","Uwe","Seiler","MSC Bad Godesberg e.V.","","","","","",""]
[41018,"Sm 1","Oliver","Seilz","Reinickendorfer MGC e.V.","","","","","",""]
[44841,"Sm 1","Rainer","Seinsche","MGC Homburger Land e.V.","","","","","",""]
[29950,"Sm 2","Michael","Seiz","MGC Schwaikheim e.V.","","","","","",""]
[45788,"H","Heiko","Selka","MSK Neheim-Hüsten e.V.","","","","","",""]
[45198,"Sm 1","Thorsten","Semrau","SGC \"Glocke\" Castrop e.V.","","","","","",""]
[66859,"D","Jessica","Senke","MGC Rot-Weiß Wanne-Eickel e.V.","","","","","",""]
[66858,"Sm 1","Andreas","Senke","MGC Rot-Weiß Wanne-Eickel e.V.","","","","","",""]
[6721,"Sw 2","Bärbel","Senke","MGC Rot-Weiß Wanne-Eickel e.V.","","","","","",""]
[66781,"D","Corinna","Serfling","MSG Kempten e.V.","","","","","",""]
[66873,"H","Moritz","Sesselmann","1. FMGC Lichtenfels 1961 e.V.","","","","","",""]
[67237,"Jm","Christoph","Sesselmann","1. FMGC Lichtenfels 1961 e.V.","","","","","",""]
[34720,"Sm 2","Wolfgang","Sessler","1. BGC Landshut e.V.","","","","","",""]
[34717,"Sw 2","Susanne","Sessler","1. BGC Landshut e.V.","","","","","",""]
[40401,"Sm 2","Jürgen","Seubert","TV Niederstetten 1862 e.V.  Abt. Minigolf","","","","","",""]
[31289,"H","Andreas","Seumenicht","TSV Kücknitz Abt. Bahnengolf","","","","","",""]
[48952,"Sm 1","Norbert","Seus","MGC Wertheim 91 e.V.","","","","","",""]
[30411,"H","Andreas","Seyen","MC Möve Cuxhaven","Ja","","","","",""]
[37012,"Sm 2","Edmund","Sibilski","BGC Hannover","Ja","","","","",""]
[22127,"Sm 1","Zoltan","Sic","MGC Millennium Lorsch e.V.","","","","","",""]
[6728,"Sw 2","Terezia","Sic","MGC Bad Homburg vdH e.V.","","","","","",""]
[66412,"H","Timo","Sieber","ASV Pegnitz, Abt. Minigolf","","","","","",""]
[37569,"H","Thomas","Sieber","SG Arheilgen Abt. Bahnengolf","","","","","",""]
[66620,"Sm 1","Markus","Sieber","ASV Pegnitz, Abt. Minigolf","","","","","",""]
[34384,"Sm 2","Erich","Siebert","MGC Wetzlar e.V.","","","","","",""]
[36559,"Sm 2","Michael","Siebert","MGS Hildesheim","Ja","","","","",""]
[41009,"H","Thorben","Sielaff","Tempelhofer MV Berlin e.V.","","","","","",""]
[67388,"H","Jörg","Sienknecht","BGC Schweinfurt e.V.","","","","","",""]
[66077,"D","Claudia","Silex","VFB 21 Neugattersleben e. V.","","","","","",""]
[65957,"Sm 1","Gerald","Silex","VFB 21 Neugattersleben e. V.","","","","","",""]
[66076,"Sw 1","Andrea","Silex","VFB 21 Neugattersleben e. V.","","","","","",""]
[66140,"D","Jasmine","Simmerock","MGC Wetzlar e.V.","","","","","",""]
[26101,"Sm 1","Frank","Simons","Kölner Miniatur Golf Club e.V.","","","","","",""]
[48352,"Sm 1","Dirk","Sindorf","1. Minigolf-Club Rheinhausen e.V.","","","","","",""]
[43922,"Sm 1","Michael","Sinzenich","HMC Büttgen e.V.","","","","","",""]
[29482,"Sw 2","Renate","Sinzenich","HMC Büttgen e.V.","","","","","",""]
[34564,"Sm 2","Gerald","Siol","SC Bad Münder","Ja","12666","","X","",""]
[34954,"Sm 1","Andreas","Slowig","BGC Kiel West e.V.","","","","","",""]
[67166,"H","Marek","Smejkal","BGS Hardenberg-Pötter e.V.","","","","","",""]
[44768,"Sm 1","Thomas","Smyczek","TSV Pfungstadt Abt. Bahnengolf e.V.","","","","","",""]
[17842,"Sw 2","Herma","Snaga","BGC Hannover","Ja","","","","",""]
[34030,"Sm 2","Siegfried","Söchting","SC Bad Münder","Ja","","","","",""]
[38156,"Sm 1","Markus","Sodenkamp","MSK Neheim-Hüsten e.V.","","","","","",""]
[25441,"Sm 2","Bert-Rainer","Soest","MGC Homburger Land e.V.","","","","","",""]
[30548,"Sw 1","Heike","Solarski","KGC  Waldstadion Frankfurt am Main","","","","","",""]
[66335,"H","Matthias","Söldner","MSV Würzburg-Löwenbrücke e.V.","","","","","",""]
[25756,"Sm 2","Sebastian","Solleder","MGC Wolnzach e.V.","","","","","",""]
[36488,"H","Ralf","Sommer","MSG Kempten e.V.","","","","","",""]
[66973,"H","Reto","Sommer","1. MGC Mainz e.V.","","","","","",""]
[67355,"Schw","Zoe-Loreen","Sommer","MSG Kempten e.V.","","","","","",""]
[43152,"Sw 1","Birgit","Sommer","MGC Rot-Weiß Wanne-Eickel e.V.","","","","","",""]
[49260,"H","Christian","Somnitz","MC Möve Cuxhaven","Ja","21003","","","X","X"]
[36572,"Sm 2","Uwe","Sonntag","BGC Hannover","Ja","","","","",""]
[29039,"H","Daniel","Sorg","MGF 77 Sickenhausen e.V.","","","","","",""]
[23831,"Sm 2","Heinrich","Sorg","MGF 77 Sickenhausen e.V.","","","","","",""]
[33951,"Sm 2","Rainer","Sorgenfrei","BGC Illertissen e.V.","","","","","",""]
[33712,"D","Britta","Spandau","MGC Peine","Ja","11820","","X","",""]
[42332,"Sm 1","Christian","Spandau","TSV Salzgitter","Ja","17396","","X","",""]
[34546,"Sm 2","Ernst","Spanner","BGC Illertissen e.V.","","","","","",""]
[64594,"H","Peter","Spehn","MGC Bad Waldsee 1990 e.V.","","","","","",""]
[66545,"Sm 1","Jeffrey","Spence","MGC Bad Homburg vdH e.V.","","","","","",""]
[66546,"Sw 1","Manuela","Spence-Kunz","MGC Bad Homburg vdH e.V.","","","","","",""]
[37666,"H","Christian","Spennesberger","MGC Murnau am Staffelsee e.V.","","","","","",""]
[40159,"H","Sascha","Sperling","BGC Bad Nenndorf","Ja","","","","",""]
[40389,"H","Sven","Sperling","BGC Diepholz","Ja","","","","",""]
[51629,"Sm 1","Sascha","Sperling","MSV Bad Münder/Springe","Ja","21789","","X","",""]
[35640,"Sm 1","Frank","Spettel","MGC Wertheim 91 e.V.","","","","","",""]
[6280,"Sw 2","Maria","Spieleder","BGC Neutraubling e.V.","","","","","",""]
[31503,"Sm 1","Manfred","Spielfeld","SGC Hagen e.V.","","","","","",""]
[31489,"Sm 2","Detlef","Spielfeld","MGC Dortmund Syburg e.V.","","","","","",""]
[31501,"Sm 2","Siegfried","Spielfeld","SGC Hagen e.V.","","","","","",""]
[49066,"Sm 1","Thomas","Spies","HMC Büttgen e.V.","","","","","",""]
[41300,"Sm 1","Sepp","Splettstößer","Minigolf Wölfe Rheinstetten 02","","","","","",""]
[26787,"Sm 1","Volker","Spohr","BGC Leipzig","","","","","",""]
[36205,"H","Sascha","Spreier","1. KC Homburg-Saar 1967 e.V.","","","","","",""]
[65836,"Jm","Lars","Sprengkamp","MGF Magdeburg 1995 e.V.","","","","","",""]
[34782,"H","Roman","Springer","OMGC Ingolstadt e.V.","","","","","",""]
[35081,"Sm 2","Wilfried","Springer","OMGC Ingolstadt e.V.","","","","","",""]
[34841,"Sw 2","Rosmarie","Springer","OMGC Ingolstadt e.V.","","","","","",""]
[31572,"H","Lars","Springob","SSC Attendorn e.V.","","","","","",""]
[38477,"H","René","Springob","MSK Neheim-Hüsten e.V.","","","","","",""]
[38017,"D","Justine","Springob","SSC Attendorn e.V.","","","","","",""]
[64598,"Sm 1","Patric","Sprung","BGC Bad Mergentheim e.V.","","","","","",""]
[50895,"Sm 2","Georg","Stabl","SSV Ulm 1846 Abt. Bahnengolf","","","","","",""]
[31903,"H","Jan","Stachowiak","MGC Rot-Weiß Wanne-Eickel e.V.","","","","","",""]
[67285,"Schm","Leon","Staeubert","MSK Olching e.V.","","","","","",""]
[64940,"H","Jan","Stahmann","MGC Lohfelden","Ja","","","","",""]
[66480,"H","Sebastian","Stallkamp","Osnabrücker M.-C. von 1963 e.V.","","","","","",""]
[66606,"Sm 1","Andreas","Stallkamp","Osnabrücker M.-C. von 1963 e.V.","","","","","",""]
[66704,"Sm 1","Thomas","Stallkamp","MC Georgsmarienhütte e.V.","","","","","",""]
[43996,"Sm 1","Sebastian","Stallmann","MGC Marl 1960 e.V.","","","","","",""]
[38295,"Sw 1","Anita","Stamm","1. Essener CGC \"Blau-Gold\" e.V.","","","","","",""]
[24288,"Sm 2","Dirk","Stamm","1. Essener CGC \"Blau-Gold\" e.V.","","","","","",""]
[33125,"Sm 1","Siegfried","Stanchly","BGC Heilbronn e.V.","","","","","",""]
[31756,"H","Carsten","Stang","MGC Bad Hersfeld","","","","","",""]
[64902,"H","Tim-Niklas","Stange","BGC Hannover","Ja","","","","",""]
[1989,"Sm 1","Michael","Stange","BGC Hannover","Ja","3553","X","","",""]
[2241,"Sw 1","Anja","Stange","BGC Hannover","Ja","","","","",""]
[34799,"Sm 2","Hans-Werner","Stange","SV Lurup Abt. Bahnengolf","","","","","",""]
[66867,"Sm 2","Karl","Stängl","1. BGC Landshut e.V.","","","","","",""]
[29997,"Sm 1","Ulrich","Stappenbeck","1. BGC Wesseling 1975 e.V.","","","","","",""]
[45118,"Sm 2","Wolfgang","Stargardt","1. MGC Metzingen e.V.","","","","","",""]
[65465,"H","Florian","Stark","MC Möve Cuxhaven","Ja","26085","X","","",""]
[3524,"Sm 2","Rupert","Stark","OMGC Ingolstadt e.V.","","","","","",""]
[3568,"Sm 2","Werner","Starke","MSK Olching e.V.","","","","","",""]
[36161,"H","Birk","Starrost","Reinickendorfer MGC e.V.","","","","","",""]
[32959,"Sm 1","Thomas","Staska","MGF Ottobrunn e.V.","","","","","",""]
[66934,"Jm","Marcel","Staudt","Miniaturgolf Sportclub Schriesheim e.V","","","","","",""]
[40425,"Sw 1","Ilka","Stautmeister","BGC Wolfsburg","Ja","16380","","","","X"]
[37926,"Sm 1","Ingo","Stawitzke","Minigolfunion Neviges-Odenthal 1968 e.V.","","","","","",""]
[34775,"Sm 2","Hans-Georg","Steeg","1. Essener CGC \"Blau-Gold\" e.V.","","","","","",""]
[5053,"Sm 2","Werner","Steeger","SSC Halver e.V.","","","","","",""]
[34507,"Sw 2","Waltraud","Steffens","BGC Goslar","Ja","","","","",""]
[67304,"D","Iris","Steffens-Bruelheide","MGC Bad Salzuflen e.V.","","","","","",""]
[27838,"H","Ulf","Stegmaier","BIG ASPERG e.V.","","","","","",""]
[66897,"Sm 1","Udo","Stegmayr","MGF Ottobrunn e.V.","","","","","",""]
[44123,"Sm 2","Uwe","Steier","Niendorfer MC","","","","","",""]
[44379,"Sw 1","Sonja","Steinburg","MGC Dormagen-Brechten e.V.","","","","","",""]
[6796,"Sm 2","Ralf","Steinhausen","BGC Bremen","Ja","5098","","X","","X"]
[41367,"Sm 2","Hubert","Steinhoff","MSK Neheim-Hüsten e.V.","","","","","",""]
[33580,"Sm 2","William","Stellato","MGC Wertheim 91 e.V.","","","","","",""]
[21876,"Sm 2","Friedhelm","Steller","CGC Illertal Kellmünz","","","","","",""]
[6075,"Sm 2","Klaus","Stelter","SV Lurup Abt. Bahnengolf","","","","","",""]
[18104,"Sm 2","Jürgen","Stelter","SV Lurup Abt. Bahnengolf","","","","","",""]
[6006,"Sw 2","Karin","Stelter","SV Lurup Abt. Bahnengolf","","","","","",""]
[66711,"Jm","Kai","Stelzer","1. MGC Paderborn e.V.","","","","","",""]
[47402,"D","Michaela","Stemplinger","BGC 90 Ottobrunn e.V.","","","","","",""]
[37404,"Jw","Franziska","Stemplinger","BGC 90 Ottobrunn e.V.","","","","","",""]
[33974,"Sm 2","Ludwig","Stemplinger","BGC 90 Ottobrunn e.V.","","","","","",""]
[46386,"Sm 1","Christian","Stendel","Reinickendorfer MGC e.V.","","","","","",""]
[36312,"H","Patrick","Steneberg","MGC Kassel","Ja","","","","",""]
[4348,"Sm 2","Michael","Stephan","1. BGC Landshut e.V.","","","","","",""]
[66285,"Sm 1","Markus","Stern","BGC Bremen","Ja","28281","X","","",""]
[10099,"Sm 2","Udo","Sternemann","BGSV Castrop e.V. 1961","","","","","",""]
[66281,"Sw 2","Elisabeth","Stertkamp","BV Sennestadt","","","","","",""]
[27348,"H","Marco","Sterzenbach","Miniaturgolf Sportclub Schriesheim e.V","","","","","",""]
[35625,"Sm 2","Helmut","Steuer","BGC Illertissen e.V.","","","","","",""]
[66703,"Sm 1","Stephan","Stewens","1. BGC Landshut e.V.","","","","","",""]
[67019,"Schm","Jan Malte","Stief","MC 62 Lüdenscheid e.V.","","","","","",""]
[67223,"Sm 2","Hans-Dieter","Stier","1. MC Weinheim e.V.","","","","","",""]
[67097,"H","Sören","Stift","MGC Harrislee-Wassersleben","","","","","",""]
[30319,"H","Kris","Stille","Niendorfer MC","","","","","",""]
[66100,"H","Thomas","Stock","MGC Bad Bodendorf e.V.","","","","","",""]
[41929,"Sm 1","Manfred","Stock","MGC Bad Bodendorf e.V.","","","","","",""]
[356,"H","Martin","Stöckle","Niendorfer MC","","","","","",""]
[5219,"Sm 2","Paul","Stöckle","SSV Ulm 1846 Abt. Bahnengolf","","","","","",""]
[63273,"Sm 2","Jochen","Stoll","MGC Bad Oldesloe e.V.","","","","","",""]
[18249,"Sm 2","Hans","Stolt","1. MGC Tuttlingen e.V.","","","","","",""]
[27937,"H","Branislav","Stoparic","MGC Millennium Lorsch e.V.","","","","","",""]
[22496,"H","Miroslav","Stoparic","1. MGC Mainz e.V.","","","","","",""]
[28333,"Sm 2","Martin","Stopper","BSV 86 München e.V.","","","","","",""]
[31829,"Sw 2","Erika","Stopper","BSV 86 München e.V.","","","","","",""]
[66637,"Sw 1","Daniela","Störger","MSC Bensheim-Auerbach e.V.","","","","","",""]
[43139,"Sm 1","Frank","Störmer","KSV Baltrum e.V.","","","","","",""]
[31301,"Sm 2","Hans-Jürgen","Stötzer","1. BGC Wesseling 1975 e.V.","","","","","",""]
[36353,"H","Stephan","Stranka","1. BGC Garmisch-Partenkirchen","","","","","",""]
[66600,"Sm 2","Giuseppe","Strano","BGSC \"Gut Schlag\" Gladbeck e.V.","","","","","",""]
[64776,"H","Christian","Strasser","1. BGC Landshut e.V.","","","","","",""]
[64775,"Sm 2","Johann","Strasser","1. BGC Landshut e.V.","","","","","",""]
[33184,"H","Christian","Straub","MGC Sulzfeld e.V.","","","","","",""]
[35657,"H","Michael","Straub","MGC Sulzfeld e.V.","","","","","",""]
[37045,"Sw 2","Christa","Streit","Minigolfunion Neviges-Odenthal 1968 e.V.","","","","","",""]
[33658,"Sm 1","Manfred","Strohmaier","SSV Ulm 1846 Abt. Bahnengolf","","","","","",""]
[67394,"Sm 1","Uwe","Strohmenger","1. MC Weinheim e.V.","","","","","",""]
[67396,"Sw 1","Claudia","Strohmenger","1. MC Weinheim e.V.","","","","","",""]
[66889,"Jm","Marcello","Stromboli","MTV Seesen","Ja","","","","",""]
[34700,"Sm 1","Holger","Strube","MGC Bad Soden-Salmünster","","","","","",""]
[35809,"Sw 1","Catalina","Strube","MGC Bad Soden-Salmünster","","","","","",""]
[17680,"Sm 2","Günter","Strunk","MC 62 Lüdenscheid e.V.","","","","","",""]
[35201,"H","Bernd","Stübgen","MGC Peine","Ja","","","","",""]
[67042,"Schm","Connor","Stübiger","BGSV Aßlar 1987 e.V.","","","","","",""]
[38224,"H","Martin","Stukan","BGC Schweinfurt e.V.","","","","","",""]
[38362,"Sm 1","Ingo","Stuppy","1. MGC Mannheim 1968 e.V.","","","","","",""]
[37814,"H","Tobias","Sturm","MGC Murnau am Staffelsee e.V.","","","","","",""]
[27255,"Sm 1","Joachim","Sturm","MGC Dormagen-Brechten e.V.","","","","","",""]
[26576,"Sm 2","Norbert","Sturm","MGC Ingolstadt e.V.","","","","","",""]
[29722,"Sm 2","Werner","Sturm","MGC Murnau am Staffelsee e.V.","","","","","",""]
[64201,"Sw 2","Dietlind","Sturm","MGC Murnau am Staffelsee e.V.","","","","","",""]
[37147,"H","Sebastian","Stürmer","1. KC Homburg-Saar 1967 e.V.","","","","","",""]
[37460,"Sm 2","Klaus","Stürmer","1. KC Homburg-Saar 1967 e.V.","","","","","",""]
[36587,"Sm 1","Wolfgang","Stute","MGC Monrepos e.V.","","","","","",""]
[33800,"H","Oliver","Suche","MGC Schwaikheim e.V.","","","","","",""]
[37780,"H","Brian","Suchomel","MC Tigers Künsebeck","","","","","",""]
[66005,"Sw 2","Dagmar","Suchy","BGSV Bad Homburg","","","","","",""]
[44353,"Sm 1","Frank","Südhoff","CGC Grün-Gold Bad Hamm e.V.","","","","","",""]
[26352,"Sm 1","Lutz","Suhrbier","Tempelhofer MV Berlin e.V.","","","","","",""]
[44865,"Sm 1","Christopher","Süling","MC Möve Cuxhaven","Ja","","","","",""]
[32849,"Sm 2","Hans-Gerd","Sülzen","MGS Hildesheim","Ja","","","","",""]
[32850,"Sw 2","Annelie","Sülzen","MGS Hildesheim","Ja","","","","",""]
[24727,"Sm 2","Jürgen","Summ","MGC Sulzfeld e.V.","","","","","",""]
[6234,"Sm 2","Rudi","Surau","1. MSC Hamburg-Neu Wulmstorf","","","","","",""]
[50830,"Sm 2","Udo","Süß","MSV Bad Kreuznach","","","","","",""]
[43693,"Sm 1","Michael","Sussek","BGC Wolfsburg","Ja","","","","",""]
[67255,"H","Nadja","Swierczynski","MGV Spandau","","","","","",""]
[67256,"Sw 2","Gabriele","Swierczynski","MGV Spandau","","","","","",""]
[31988,"D","Daniela","Symanzyk","MC Möve Cuxhaven","Ja","10781","X","","",""]
[66837,"Sm 1","Patrick","Symanzyk","MC Möve Cuxhaven","Ja","","","","",""]
[36570,"H","Manuel","Szablikowski","1. MGC Mainz e.V.","","","","","",""]
[37981,"Jm","Tim","Szablikowski","1. MGC Mainz e.V.","","","","","",""]
[25536,"Sm 1","Axel","Szablikowski","1. MGC Mainz e.V.","","","","","",""]
[30493,"Sm 1","Bernd","Szablikowski","1. MGC Mainz e.V.","","","","","",""]
[44243,"Sm 1","André","Szablikowski","1. MGC Mainz e.V.","","","","","",""]
[29090,"Sw 1","Anke","Szablikowski","1. MGC Mainz e.V.","","","","","",""]
[29092,"Sw 1","Petra","Szablikowski","1. MGC Mainz e.V.","","","","","",""]
[37507,"Sm 1","Harald","Szabo","1. MGC Hechingen","","","","","",""]
[48004,"Sm 1","Jörg","Sziele","MGC Wertheim 91 e.V.","","","","","",""]
[67272,"Sw 1","Ilka","Szukowski","BSG Pneumant Fürstenwalde e.V., Abt. Minigolf","","","","","",""]
[27974,"Sm 2","Peter","Tabor","MGC \"AS\" Witten 1963 e.V.","","","","","",""]
[36355,"H","Julian","Tafel","1. BGC Garmisch-Partenkirchen","","","","","",""]
[36894,"D","Melanie","Tafel","1. BGC Garmisch-Partenkirchen","","","","","",""]
[38199,"Jm","Daniel","Tafel","1. BGC Garmisch-Partenkirchen","","","","","",""]
[28604,"Sm 1","Manfred","Tafel","1. BGC Garmisch-Partenkirchen","","","","","",""]
[45237,"Sw 1","Susanne","Tafel","1. BGC Garmisch-Partenkirchen","","","","","",""]
[38509,"H","Marcel","Tannheuser","Bochumer Minigolf-Club 1960 e.V.","","","","","",""]
[65725,"Sm 2","Reinhard","Tasche","SC Wermelskirchen 1976 e.V.","","","","","",""]
[65724,"Sw 2","Edeltraut","Tasche","SC Wermelskirchen 1976 e.V.","","","","","",""]
[41313,"Sm 1","Angelo","Tatti","BGC Heilbronn e.V.","","","","","",""]
[3621,"Sm 2","Clemente","Tatti","BGC Heilbronn e.V.","","","","","",""]
[30769,"Sm 1","Volker","Tatzelt","Niendorfer MC","","","","","",""]
[4761,"Sm 2","Peter","Taudien","MSC Bad Godesberg e.V.","","","","","",""]
[36632,"Sm 1","Gunter","Tauterat","MGC Monrepos e.V.","","","","","",""]
[36633,"Sw 1","Carmen","Tauterat","BGC Bad Mergentheim e.V.","","","","","",""]
[33986,"Sw 2","Eleonore","Tautrims","MGC Bad Homburg vdH e.V.","","","","","",""]
[4244,"Sm 2","Peter","Tautz","VfM Bottrop e.V.","","","","","",""]
[5715,"Sw 2","Brigitte","Te Kamp","SC Wermelskirchen 1976 e.V.","","","","","",""]
[67346,"Schm","Finn","Teetzen","MGV Bremen","Ja","","","","",""]
[67345,"Sm 1","Michael","Teetzen","MGV Bremen","Ja","","","","",""]
[6014,"Sm 2","Heinrich","Teine","BGC Dormagen e.V.","","","","","",""]
[33964,"H","Marco","Templin","BGS Hardenberg-Pötter e.V.","","","","","",""]
[33367,"H","Stefan","ten Voorde","BGC Bremen","Ja","","","","",""]
[27576,"D","Bianca","ten Voorde","BGC Bremen","Ja","","","","",""]
[37319,"D","Kerstin","Tennigkeit","1. KC Homburg-Saar 1967 e.V.","","","","","",""]
[41710,"Sm 1","Michael","Tesch","BGC Schloß Paffendorf e.V.","","","","","",""]
[48559,"Sm 1","Jörg","Tetzlaff","Reinickendorfer MGC e.V.","","","","","",""]
[50596,"H","Jan-Christoph","Theden","MGC Olympia Kiel e.V.","","","","","",""]
[34879,"Sm 2","Michael","Theimann","BGS Hardenberg-Pötter e.V.","","","","","",""]
[28510,"H","Sven","Thelen","BGSV Kerpen e.V.","","","","","",""]
[66593,"H","Kai","Theobald","TV Nierstein 1901 e.V., Abt. Minigolf","","","","","",""]
[66592,"H","Tobias","Theobald","TV Nierstein 1901 e.V., Abt. Minigolf","","","","","",""]
[24892,"Sm 1","Matthias","Thiebes","BGC Bad Mergentheim e.V.","","","","","",""]
[45943,"Sm 1","Stephan","Thiel","MV Lankwitzer Dragons","","","","","",""]
[34360,"Sm 2","Helmut","Thiel","BGC Hannover","Ja","","","","",""]
[34361,"Sw 2","Gerda","Thiel","BGC Hannover","Ja","","","","",""]
[43548,"Sw 1","Elke","Thiem","MSC Bensheim-Auerbach e.V.","","","","","",""]
[36565,"Sm 2","Frank","Thies","BGC Northeim","Ja","","","","",""]
[61511,"Sm 2","Paul","Thimm","MPF Hardt e.V.","","","","","",""]
[48286,"Sm 2","Hans-Jürgen","Thölke","MGC Murnau am Staffelsee e.V.","","","","","",""]
[38597,"H","Andreas","Thomas","MGC Ostheim / Rhön e.V.","","","","","",""]
[67397,"Sm 2","Herbert","Thomas","BGSV Castrop e.V. 1961","","","","","",""]
[35702,"H","Tilo","Thomsen","MGC Olympia Kiel e.V.","","","","","",""]
[67100,"D","Tanja","Thomsen","MGC Harrislee-Wassersleben","","","","","",""]
[67099,"Jm","Jan","Thomsen","MGC Harrislee-Wassersleben","","","","","",""]
[38501,"Sm 1","Ralf","Thren","MSC Bad Godesberg e.V.","","","","","",""]
[38502,"Sw 1","Sigrid","Thren-Bös","MSC Bad Godesberg e.V.","","","","","",""]
[37289,"H","Marwin","Throne","ASV Pegnitz, Abt. Minigolf","","","","","",""]
[37290,"Sm 2","Werner","Throne","PTSV Hof, Abt. Minigolf ","","","","","",""]
[30924,"H","Christian","Thümmler","ASV Pegnitz, Abt. Minigolf","","","","","",""]
[31419,"H","Timo","Thun","MGV Bremen","Ja","10451","X","","",""]
[6586,"Sm 2","Dieter","Thun","MGV Bremen","Ja","","","","",""]
[41317,"Sm 1","Thomas","Thusek","BGC Heilbronn e.V.","","","","","",""]
[26670,"Sm 2","Hans-Joachim","Thüsen","MSF Brilon e.V.","","","","","",""]
[66788,"H","Michael","Tiedtke","MGV Bremen","Ja","29121","X","","",""]
[4732,"Sm 2","Reinhard","Tierling","SC Olympia Dortmund e.V.","","","","","",""]
[67326,"D","Marlene","Tietz","1. Essener CGC \"Blau-Gold\" e.V.","","","","","",""]
[48644,"H","Axel Eric","Timm","TSV Pfungstadt Abt. Bahnengolf e.V.","","","","","",""]
[6771,"Sm 2","Dietmar","Tinney","Hamburger MC von 1965 e.V.","","","","","",""]
[29336,"Sm 2","Uwe","Tinzmann","1. MGSV Netphen e.V.","","","","","",""]
[43144,"Sm 2","Jürgen","Tismer","MGC Bad Salzuflen e.V.","","","","","",""]
[5438,"Sm 2","Franz","Tockner","MGC \"AS\" Witten 1963 e.V.","","","","","",""]
[24603,"Sm 1","Klaus","Todtenhöfer","BGC Dormagen e.V.","","","","","",""]
[31347,"Sm 1","Ingolf","Tolk","1. MGC Tuttlingen e.V.","","","","","",""]
[37500,"H","Mathias","Tomkowitz","KSV Baltrum e.V.","","","","","",""]
[32802,"D","Stefanie","Tomkowitz","KSV Baltrum e.V.","","","","","",""]
[29648,"H","Michael","Töpelt","BGC Leipzig","","","","","",""]
[37907,"D","Eva","Töpelt","BGC Leipzig","","","","","",""]
[37793,"Sm 2","Jürgen","Torka","1. MGC Gelsenkirchen e.V.","","","","","",""]
[27087,"Sm 1","Harald","Träger","MGC Bad Salzuflen e.V.","","","","","",""]
[30869,"Sm 1","Andreas","Träger","BGSV Kerpen e.V.","","","","","",""]
[43923,"Sw 1","Petra","Träger","HMC Büttgen e.V.","","","","","",""]
[66435,"H","Manuel","Tramp","KSV Baltrum e.V.","","","","","",""]
[46126,"H","Andreas-Wolfram","Trauner","MSK Olching e.V.","","","","","",""]
[43716,"Sm 2","Karl","Trauner","BSV 86 München e.V.","","","","","",""]
[43715,"Sw 2","Anneliese","Trauner","BSV 86 München e.V.","","","","","",""]
[36781,"Sm 1","Clemens","Trautmann","MGV Spandau","","","","","",""]
[67314,"Sm 2","Herbert","Trautmann","MGC Bad Homburg vdH e.V.","","","","","",""]
[5274,"Sm 2","Franz","Treffer","OMGC Ingolstadt e.V.","","","","","",""]
[47135,"Sm 1","Bernd","Trempenau","MGC Bad Salzuflen e.V.","","","","","",""]
[38530,"H","Matthias","Trenz","BGC Bildstock e.V.","","","","","",""]
[66644,"Sw 1","Christine","Trepesch","1. MGC Tuttlingen e.V.","","","","","",""]
[6191,"Sm 2","Peter","Trettl","MGC putter Künzell 1970 e.V.","","","","","",""]
[17987,"Sm 2","Adi","Trillges","BGSV Kerpen e.V.","","","","","",""]
[4880,"Sw 2","Brigitte","Trillges","BGSV Kerpen e.V.","","","","","",""]
[36623,"Sm 2","Werner","Trinkl","MSK Olching e.V.","","","","","",""]
[36625,"Sw 2","Bettina","Trinkl","MSK Olching e.V.","","","","","",""]
[66640,"Schm","Levi","Tritsch","MSC Bensheim-Auerbach e.V.","","","","","",""]
[36489,"D","Katharina","Trojak","MSG Kempten e.V.","","","","","",""]
[3841,"Sm 2","Manfred","Trojand","SSV Ulm 1846 Abt. Bahnengolf","","","","","",""]
[38133,"Sm 1","Jürgen","Tröller","SV 1890 e.V. Dreieichenhain, Abt. Bahnengolf","","","","","",""]
[49289,"Sm 2","Rolf","Trompeter","SSC Halver e.V.","","","","","",""]
[60795,"Sm 2","Hermann","Trossen","MGC Peine","Ja","","","","",""]
[63610,"Sm 1","Burkhard","Trümbach","MGC \"Stahlquelle\" Bad Bocklet","","","","","",""]
[40643,"Sm 2","Jürgen","Tschischka","1. MGC München-Feldmoching e.V.","","","","","",""]
[5739,"Sw 2","Erika","Tuchs","MGC Murnau am Staffelsee e.V.","","","","","",""]
[36733,"Sm 2","Rudolf","Tümmers","VfM Bottrop e.V.","","","","","",""]
[38309,"H","Nehemia","Türk","1. MGC Mainz e.V.","","","","","",""]
[66310,"H","Cedric Alexander","Türk","MSK Neheim-Hüsten e.V.","","","","","",""]
[36173,"Sm 2","Uwe","Tusch","MGC Göttingen","Ja","14182","X","","",""]
[67412,"Sm 1","Wolfgang","Ucka","1. MSC Wesel 6.6.1966 e.V.","","","","","",""]
[67411,"Sw 1","Marion","Ucka","1. MSC Wesel 6.6.1966 e.V.","","","","","",""]
[37003,"H","Tim","Uebe","1. MGC Mainz e.V.","","","","","",""]
[67102,"Schm","Jason","Uetzmann","Tempelhofer MV Berlin e.V.","","","","","",""]
[66441,"Sm 2","Heinrich","Uetzmann","Tempelhofer MV Berlin e.V.","","","","","",""]
[34151,"D","Jasmin Astrid","Uhl","MGC Olympia Kiel e.V.","","","","","",""]
[30695,"Sw 1","Birgit","Uhl","MGC Olympia Kiel e.V.","","","","","",""]
[36133,"Sm 1","Thorsten","Uhlig","MSC Blau-Weiß 2003 München e.V.","","","","","",""]
[42068,"Sm 1","Thorsten","Uhlir","SSC Halver e.V.","","","","","",""]
[47176,"Sm 1","Werner","Uhr","1. MSC Hamburg-Neu Wulmstorf","","","","","",""]
[37956,"H","Dominik","Ullrich","1. MGC Mainz e.V.","","","","","",""]
[33761,"H","Stefan","Ulrich","1. MGC Ludwigshafen e.V.","","","","","",""]
[66988,"D","Miriam","Ulrich","1. MGC Ludwigshafen e.V.","","","","","",""]
[29919,"Sm 2","Uwe","Ulrich","BGC Goslar","Ja","9514","","X","",""]
[45991,"Sm 1","Andreas","Umbach","MGC Kassel","Ja","","","","",""]
[38310,"H","Lukas","Umhauer","1. MGC Mainz e.V.","","","","","",""]
[2411,"Sm 2","Jens","Umhauer","1. MGC Mainz e.V.","","","","","",""]
[34732,"H","Uwe","Ungermann","BSC Ennepetal e.V.","","","","","",""]
[38216,"H","Thomas","Unglaube","BGC Dormagen e.V.","","","","","",""]
[67170,"Sm 1","Joerg","Unruh","MGC Millennium Lorsch e.V.","","","","","",""]
[26698,"Sm 2","Horst","Unterleitner","CGC Illertal Kellmünz","","","","","",""]
[27425,"H","Maik","Urban","SSC Halver e.V.","","","","","",""]
[66186,"Jm","Dominic","Urban","MGC \"AS\" Witten 1963 e.V.","","","","","",""]
[35604,"Sm 1","Volker","Urban","MGC \"AS\" Witten 1963 e.V.","","","","","",""]
[35605,"Sw 1","Angela","Urban","MGC \"AS\" Witten 1963 e.V.","","","","","",""]
[30422,"H","Patrick","Urbanke","MGC Bad Soden-Salmünster","","","","","",""]
[32844,"D","Ricarda","Urbanski","1. Essener CGC \"Blau-Gold\" e.V.","","","","","",""]
[41095,"Sm 1","Karsten","Urbanski","1. Essener CGC \"Blau-Gold\" e.V.","","","","","",""]
[23,"Sw 1","Monika","Vahle","MSK Neheim-Hüsten e.V.","","","","","",""]
[67224,"Sw 1","Kerstin","Vallot","MGC Heringen 1997 e.V.","","","","","",""]
[29061,"H","Mark","van der Wals","1. MGC Epe 1978 e.V.","","","","","",""]
[33059,"H","Dirk","van der Wals","1. MGC Epe 1978 e.V.","","","","","",""]
[26404,"Sm 2","Wilfried","van der Wals","1. MGC Epe 1978 e.V.","","","","","",""]
[38505,"Jm","Tom","van Diejen","MSC Bensheim-Auerbach e.V.","","","","","",""]
[38415,"Jm","Jan","van Eickelen","BGV Bergisch Land 1962 / 63 e.V.","","","","","",""]
[65919,"Sm 2","Ralf","van Eickelen","BGV Bergisch Land 1962 / 63 e.V.","","","","","",""]
[36532,"H","Jan","van Vught","BGC Heilbronn e.V.","","","","","",""]
[40558,"Sm 1","Peter","Vanselow","MGC Sulzfeld e.V.","","","","","",""]
[66881,"Schw","Svenja","Vatter","1. MGC Ludwigshafen e.V.","","","","","",""]
[67128,"Sw 1","Andrea","Vätter","MTV Seesen","Ja","","","","",""]
[67066,"Sm 2","Rafael","Vazquez Santos","MC Möve Cuxhaven","Ja","","","","",""]
[31256,"Sm 1","Bernd","Veit","MGC Wetzlar e.V.","","","","","",""]
[67124,"H","Alexander","Vellone","BGC Bad Nenndorf","Ja","","","","",""]
[27127,"Sm 1","Nicolo","Vellone","BGC Bad Nenndorf","Ja","","","","",""]
[48946,"Sm 1","Dirk","Vennemann","VfB Osnabrück e.V.","","","","","",""]
[65961,"Sm 1","Ralf","Vennemann","MC Georgsmarienhütte e.V.","","","","","",""]
[67382,"Sm 1","Gerhard","Verges","1. MGC Ladenburg e.V.","","","","","",""]
[29907,"Sm 1","Alfred","Verhoeven","BGC Dormagen e.V.","","","","","",""]
[37766,"H","Julian","Vernaleken","MGC Bad Salzuflen e.V.","","","","","",""]
[37481,"Sm 2","Michael","Verstegen","1. MSC Wesel 6.6.1966 e.V.","","","","","",""]
[41143,"Sm 1","Andreas","Vesper","MGC Bad Homburg vdH e.V.","","","","","",""]
[33945,"D","Renate","Vetter","MSC Bensheim-Auerbach e.V.","","","","","",""]
[36659,"Sm 2","Peter","Vielhauer","1. MGC Epe 1978 e.V.","","","","","",""]
[36658,"Sw 2","Marieluise","Vielhauer","1. MGC Epe 1978 e.V.","","","","","",""]
[34501,"Sm 1","Ralf","Vittinghoff","1. MGC Ladenburg e.V.","","","","","",""]
[5272,"Sm 2","Leonhard","Vocht","OMGC Ingolstadt e.V.","","","","","",""]
[38513,"H","Maximilian","Vogel","MGF Ottobrunn e.V.","","","","","",""]
[38512,"Sm 1","Thomas","Vogel","MGF Ottobrunn e.V.","","","","","",""]
[282,"Sm 2","Klaus","Vogentanz","1. MGC Bamberg e.V.","","","","","",""]
[17977,"Sm 2","Peter","Vogl","ASV Pegnitz, Abt. Minigolf","","","","","",""]
[44676,"Sm 1","Markus","Vogt","BGC Schloß Paffendorf e.V.","","","","","",""]
[47299,"Sm 1","Michael","Vogt","MGC Dormagen-Brechten e.V.","","","","","",""]
[60895,"Sm 2","Karl-Heinz","Vogt","ASV Pegnitz, Abt. Minigolf","","","","","",""]
[5959,"Sm 2","Johannes","Völk","MGC Murnau am Staffelsee e.V.","","","","","",""]
[27141,"Sm 1","Robert","Völkel","ASV Pegnitz, Abt. Minigolf","","","","","",""]
[24417,"Sm 2","Erhard","Völkel","1. NMC Kelheim e.V.","","","","","",""]
[47134,"Sm 1","Michael","Volkmer","BV Sennestadt","","","","","",""]
[47133,"Sw 1","Iris","Volkmer-Ruben","BV Sennestadt","","","","","",""]
[43224,"Sm 2","Jürgen","Vollmer","1. BGC Paderborn e.V.","","","","","",""]
[66544,"D","Anja","Vollrath","MGC Bad Homburg vdH e.V.","","","","","",""]
[37329,"Sm 1","Frank","Völzke","HMC Büttgen e.V.","","","","","",""]
[37670,"Sm 1","Peter","vom Berg","BGC Schloß Paffendorf e.V.","","","","","",""]
[34494,"H","Felix","vom Bruch","MSK Neheim-Hüsten e.V.","","","","","",""]
[261,"Sm 1","Lars","Vomhof","MSK Neheim-Hüsten e.V.","","","","","",""]
[49943,"H","Kay","von Beuningen","VfL Lohbrügge Abt. Bahnengolf","","","","","",""]
[32379,"H","Sebastian","von Block","MSC Bad Godesberg e.V.","","","","","",""]
[25562,"Sm 1","Andreas","von dem Knesebeck","MGC Göttingen","Ja","7552","","X","","X"]
[36691,"Sw 1","Alexandra","von dem Knesebeck","MGC Göttingen","Ja","14700","","X","",""]
[5288,"Sm 2","Ingo","von dem Knesebeck","MGC Göttingen","Ja","4489","","X","","X"]
[40235,"Sm 1","Stephan","von der Pütten","MGC Traben-Trarbach","","","","","",""]
[14562,"Sm 1","Axel","von Holten","MC Möve Cuxhaven","Ja","26119","X","","",""]
[66751,"Sm 1","Jens","von Trümbach","Minigolfclub Karlshagen e.V.","","","","","",""]
[66750,"Sw 1","Katarzyna","von Trümbach","Minigolfclub Karlshagen e.V.","","","","","",""]
[34068,"H","Waldemar","Voos","SSC Halver e.V.","","","","","",""]
[3720,"Sm 2","Hans-Peter","Vosberg","Minigolfunion Neviges-Odenthal 1968 e.V.","","","","","",""]
[66768,"H","Christian","Voß","1. MGC Paderborn e.V.","","","","","",""]
[49854,"H","Björn","Voß","MGC Olympia Kiel e.V.","","","","","",""]
[5675,"Sm 2","Norbert","Voß","MSK Olching e.V.","","","","","",""]
[18217,"Sm 2","Fritz","Voss","KSV Baltrum e.V.","","","","","",""]
[30196,"Sm 1","Johannes","Vosschulte","KSV Baltrum e.V.","","","","","",""]
[65283,"H","Manuel Andre","Wächter","MSK Neheim-Hüsten e.V.","","","","","",""]
[35127,"Sm 1","Sven","Wachtl","MGC Bad Homburg vdH e.V.","","","","","",""]
[4261,"Sm 2","Reinhard","Wachtl","MGC Bad Homburg vdH e.V.","","","","","",""]
[4260,"Sw 2","Renate","Wachtl","MGC Bad Homburg vdH e.V.","","","","","",""]
[5997,"Sw 2","Gertrud","Wäcke","MGC \"Stahlquelle\" Bad Bocklet","","","","","",""]
[26331,"Sm 1","Hans Rolf","Wageck","1. MGC Ludwigshafen e.V.","","","","","",""]
[37142,"Sm 1","Uwe","Wageck","1. BGC Rodalben 1977 e.V.","","","","","",""]
[61938,"Sm 2","Reinhold","Wageck","1. BGC Rodalben 1977 e.V.","","","","","",""]
[66813,"H","Christoph","Wagener","MGC Murnau am Staffelsee e.V.","","","","","",""]
[67083,"Schm","Tobias","Wagener","MGC Murnau am Staffelsee e.V.","","","","","",""]
[66313,"Sm 1","Volker","Wagener","MGC Murnau am Staffelsee e.V.","","","","","",""]
[45065,"H","Jürgen","Wagner","Miniaturgolf Sportclub Schriesheim e.V","","","","","",""]
[50472,"H","Christian","Wagner","PTSV Hof, Abt. Minigolf ","","","","","",""]
[28224,"D","Imke","Wagner","Miniaturgolf Sportclub Schriesheim e.V","","","","","",""]
[67393,"Schm","Ben","Wagner","VfM Bottrop e.V.","","","","","",""]
[26716,"Sm 1","Hans-Joachim","Wagner","1. MGC Mainz e.V.","","","","","",""]
[66800,"Sm 1","Robert","Wagner","BSC Ennepetal e.V.","","","","","",""]
[61252,"Sm 2","Gerald","Wagner","MSV Würzburg-Löwenbrücke e.V.","","","","","",""]
[5805,"Sm 2","Günter","Wagner","MSC Herscheid 1963 e.V.","","","","","",""]
[4908,"Sm 2","Franz","Wagner","1. KC Homburg-Saar 1967 e.V.","","","","","",""]
[36583,"Sw 2","Marita","Wagner","MSC Herscheid 1963 e.V.","","","","","",""]
[4906,"Sw 2","Barbara","Wagner","1. KC Homburg-Saar 1967 e.V.","","","","","",""]
[30067,"D","Sandra","Waldherr","MGC Wertheim 91 e.V.","","","","","",""]
[43576,"Sm 1","Udo","Waldmann","1. BGC Landshut e.V.","","","","","",""]
[36560,"H","Marcel","Waleska","MGC Göttingen","Ja","","","","",""]
[1185,"Sw 2","Ingrit","Walkowiak","TSV Salzgitter","Ja","","","","",""]
[38081,"Sm 1","Volker","Wallenski","TSV Kücknitz Abt. Bahnengolf","","","","","",""]
[38499,"H","Daniel","Wallich","BGC Bildstock e.V.","","","","","",""]
[65879,"Sm 2","Udo","Wallis","SV Gebhardshagen","Ja","","","","",""]
[65880,"Sw 2","Brigitte","Wallis","SV Gebhardshagen","Ja","","","","",""]
[66885,"Sm 2","Wilfried","Walter","BGC Rheinau-Freistett e.V.","","","","","",""]
[24779,"Sm 2","Udo","Walter","VfM Bottrop e.V.","","","","","",""]
[38457,"H","Denis","Walther","Minigolfclub Karlshagen e.V.","","","","","",""]
[66125,"H","Markus","Walther","Minigolfclub Karlshagen e.V.","","","","","",""]
[28026,"Sm 1","Klaus","Walther","BGC Rheinau-Freistett e.V.","","","","","",""]
[40893,"Sm 1","Uwe","Walther","1. MGC Süßen e.V.","","","","","",""]
[36712,"Sm 2","Hans-Jürgen","Walther","BGC Assindia Essen e.V.","","","","","",""]
[64930,"H","Fabio","Walz","1. BGC Landshut e.V.","","","","","",""]
[40495,"Sm 1","Christian","Wamboldt","MSK Olching e.V.","","","","","",""]
[29768,"Sw 1","Christiane","Wamboldt","MSK Olching e.V.","","","","","",""]
[66192,"Jm","Eric","Wanjek","BGSC \"Gut Schlag\" Gladbeck e.V.","","","","","",""]
[37030,"Sm 1","Guido","Wanjek","BGSC \"Gut Schlag\" Gladbeck e.V.","","","","","",""]
[37029,"Sw 1","Mandy","Wanjek","BGSC \"Gut Schlag\" Gladbeck e.V.","","","","","",""]
[33543,"H","Florian","Wanner","MGF 77 Sickenhausen e.V.","","","","","",""]
[36782,"H","Alexander","Wanner","MGF 77 Sickenhausen e.V.","","","","","",""]
[25071,"Sm 1","Hans-Jörg","Wanner","MGF 77 Sickenhausen e.V.","","","","","",""]
[33946,"Sm 1","Burkhard","Waptis","BGSV Castrop e.V. 1961","","","","","",""]
[66830,"Schm","Silas","Warkentin","TSV Pfungstadt Abt. Bahnengolf e.V.","","","","","",""]
[1612,"Sw 1","Jenifer","Warnecke","BGC Diepholz","Ja","","","","",""]
[46911,"Sw 1","Nicole","Warnecke","BGC Wolfsburg","Ja","20060","","X","",""]
[35215,"H","Manuel","Warnkens","BGC Bremen","Ja","","","","",""]
[35214,"Sm 2","Thomas","Warnkens","BGC Bremen","Ja","","","","",""]
[65415,"H","Tobias","Warschkau","SC Wermelskirchen 1976 e.V.","","","","","",""]
[24559,"Sm 2","Hans-Werner","Waschbusch","Freizeit Club Bliesen e.V.","","","","","",""]
[43441,"Sw 2","Ursula","Waschbusch","Freizeit Club Bliesen e.V.","","","","","",""]
[67176,"Sm 1","Alexander","Waskow","1.KGC Mönchengladbach e.V.","","","","","",""]
[34515,"H","Sven","Wassermann","MGC Kassel","Ja","12618","","X","",""]
[37371,"Sm 2","Peter","Waßmer","BSV Inzlingen 1979 e.V.","","","","","",""]
[65513,"Sw 2","Brigitte","Waßmer","BSV Inzlingen 1979 e.V.","","","","","",""]
[65861,"H","Sven","Waxmann","MGC Traben-Trarbach","","","","","",""]
[65862,"H","Dirk","Waxmann","MGC Traben-Trarbach","","","","","",""]
[66802,"H","Marco","Weber","Miniaturgolf Sportclub Schriesheim e.V","","","","","",""]
[23179,"H","Dennis","Weber","MGC Dortmund Syburg e.V.","","","","","",""]
[27911,"H","Dominik","Weber","KSV Baltrum e.V.","","","","","",""]
[66765,"Schw","Elena","Weber","1. BGC Landshut e.V.","","","","","",""]
[66887,"Schw","Janina","Weber","MSC Bad Godesberg e.V.","","","","","",""]
[47235,"Sm 1","Jörg Markus","Weber","BGSV Bad Homburg","","","","","",""]
[29622,"Sm 1","Hans-Dieter","Weber","MSC Bad Godesberg e.V.","","","","","",""]
[35116,"Sm 1","Bernd","Weber","VfM Bottrop e.V.","","","","","",""]
[66866,"Sw 1","Jutta","Weber","1. BGC Landshut e.V.","","","","","",""]
[38167,"Sw 1","Marianne","Weber","BGC Bad Mergentheim e.V.","","","","","",""]
[6298,"Sm 2","Karl-Otto","Weber","BGC Bad Mergentheim e.V.","","","","","",""]
[46606,"Sm 1","Sven","Wedmann","BGC Bad Nenndorf","Ja","19881","","X","","X"]
[35491,"Sm 1","Frank","Wege","BGV Backumer Tal Herten e.V.","","","","","",""]
[33976,"Sm 2","Hugo","Wehlmann","MGC Sulzfeld e.V.","","","","","",""]
[50935,"Sm 1","Markus","Wehmeyer","1. MGC Epe 1978 e.V.","","","","","",""]
[37139,"Sm 2","Dieter","Wehn","MGC \"Stahlquelle\" Bad Bocklet","","","","","",""]
[37133,"D","Svenja","Wehner","HMC Büttgen e.V.","","","","","",""]
[31003,"Sm 1","Uwe","Wehner","Reinickendorfer MGC e.V.","","","","","",""]
[27861,"Sm 1","Thomas","Wehner","HMC Büttgen e.V.","","","","","",""]
[66720,"Sw 1","Petra","Wehner","Reinickendorfer MGC e.V.","","","","","",""]
[37252,"Sw 1","Martina","Wehner","HMC Büttgen e.V.","","","","","",""]
[67384,"Sm 1","Christofer","Wehrheim","MGC Bad Homburg vdH e.V.","","","","","",""]
[35645,"H","Thorsten","Wehrmann","MGC Bad Salzuflen e.V.","","","","","",""]
[44007,"Sw 1","Petra","Weibbrecht","1. FMGC Lichtenfels 1961 e.V.","","","","","",""]
[17335,"Sm 2","Günter","Weide","MGC Kassel","Ja","","","","",""]
[5591,"Sw 2","Thusnelda","Weide","MGC Kassel","Ja","","","","",""]
[51729,"H","Andreas","Weidel","BGC Neutraubling e.V.","","","","","",""]
[34555,"Sm 2","Bernhard","Weidemann","TSV Kücknitz Abt. Bahnengolf","","","","","",""]
[32995,"H","Stefan","Weidl","MSG Kempten e.V.","","","","","",""]
[44689,"Sm 1","Ingo","Weidner","BGC Hannover","Ja","","","","",""]
[6605,"Sm 2","Klaus-Dieter","Weigang","BGC Hannover","Ja","5025","X","","",""]
[46277,"Sw 2","Barbara","Weigang","BGC Hannover","Ja","19706","","","","X"]
[38019,"Sm 2","Karlheinz","Weigenand","MC Ilvesheim e.V.","","","","","",""]
[41248,"H","Christian","Weigl","BSV Inzlingen 1979 e.V.","","","","","",""]
[67071,"Schm","Dominik","Weihs","BGS Hardenberg-Pötter e.V.","","","","","",""]
[26955,"Sm 1","Reiner","Weinberger","BGC Neutraubling e.V.","","","","","",""]
[36154,"Sm 1","Reinhold","Weinberger","1. MGC Gelsenkirchen e.V.","","","","","",""]
[3488,"Sw 2","Inge","Weinberger","BGC Neutraubling e.V.","","","","","",""]
[36153,"Sw 2","Sabine","Weinberger","1. MGC Gelsenkirchen e.V.","","","","","",""]
[67377,"H","Mike","Weingarten","MGC Nümbrecht e.V.","","","","","",""]
[35538,"H","Stefan","Weinhold","BGC Wolfsburg","Ja","","","","",""]
[40354,"Sm 2","Klaus","Weinhold","BGC Leipzig","","","","","",""]
[40360,"Sw 2","Martina","Weinhold","BGC Leipzig","","","","","",""]
[62043,"Sw 2","Helga","Weinstein","KGC  Waldstadion Frankfurt am Main","","","","","",""]
[36594,"D","Claudia","Weinzierl","1. BGC Landshut e.V.","","","","","",""]
[41137,"Sm 1","Jörg","Weirich","MSC Bensheim-Auerbach e.V.","","","","","",""]
[35006,"Sm 1","Ralf","Weis","1. Münchener MGC e.V.","","","","","",""]
[17988,"Sm 2","Norbert","Weis","BGC Schweinfurt e.V.","","","","","",""]
[48288,"Sm 1","Franz","Weiser","MGF Ottobrunn e.V.","","","","","",""]
[48289,"Sw 1","Silvia","Weiser","MGF Ottobrunn e.V.","","","","","",""]
[9244,"Sm 2","Wolfgang","Weiser","TSV Pfungstadt Abt. Bahnengolf e.V.","","","","","",""]
[38114,"Jm","Steven","Weiß","1. MGC Mainz e.V.","","","","","",""]
[67276,"Schm","Damon","Weiß","1. MGC Mannheim 1968 e.V.","","","","","",""]
[66719,"Schm","Christian","Weiß","TV Niederstetten 1862 e.V.  Abt. Minigolf","","","","","",""]
[38113,"Sm 1","Michael","Weiß","1. MGC Mannheim 1968 e.V.","","","","","",""]
[36070,"Sm 1","Rolf","Weiß","TV Niederstetten 1862 e.V.  Abt. Minigolf","","","","","",""]
[38112,"Sw 1","Jeannette","Weiß","1. MGC Mannheim 1968 e.V.","","","","","",""]
[44173,"H","Stefan","Weißenberger","TG Höchberg von 1862 Bahnengolf e.V.","","","","","",""]
[30307,"D","Angela","Weißer","BGC Heilbronn e.V.","","","","","",""]
[35784,"Sm 1","Stephan","Weißer","BGC Heilbronn e.V.","","","","","",""]
[33604,"H","Henning","Weißmann","MGC Göttingen","Ja","","","","",""]
[34150,"H","Dennis","Welpmann","MC Tigers Künsebeck","","","","","",""]
[37781,"H","Patrick","Welpmann","MC Tigers Künsebeck","","","","","",""]
[67014,"Sm 1","Ralf","Wendland","1. CGC Blau-Gelb Grötzingen","","","","","",""]
[49256,"Sm 1","Dieter","Wendlandt","MC Möve Cuxhaven","Ja","","","","",""]
[65834,"Jw","Amelie","Wendt","MSG Kempten e.V.","","","","","",""]
[38605,"Sm 1","Klaus","Wendt","MSG Kempten e.V.","","","","","",""]
[66014,"Sw 1","Elfi","Wendt","BGC Illertissen e.V.","","","","","",""]
[35896,"Sw 1","Gottholde","Weniger","CGC Rauschenberg e.V.","","","","","",""]
[66225,"Jm","Timo","Wenner","1. CGC Blau-Gelb Grötzingen","","","","","",""]
[32952,"Sm 2","Henry","Wennrich","SC Bad Münder","Ja","","","","",""]
[37916,"H","Marcel","Wentzel","VfL Lohbrügge Abt. Bahnengolf","","","","","",""]
[37949,"H","Dominik","Wentzel","Hamburger MC von 1965 e.V.","","","","","",""]
[37917,"Sw 2","Veronika","Wentzel","VfL Lohbrügge Abt. Bahnengolf","","","","","",""]
[31459,"H","Felix","Wenz","BGSV Kerpen e.V.","","","","","",""]
[32089,"H","Tobias","Wenz","BGSV Kerpen e.V.","","","","","",""]
[66221,"Sm 2","Norbert","Wenzel","BGC Hannover","Ja","","","","",""]
[5994,"Sm 2","Karl","Wenzke","MGC \"Stahlquelle\" Bad Bocklet","","","","","",""]
[35061,"H","Ulrich","Wernecke","MGC Bad Oldesloe e.V.","","","","","",""]
[37605,"Sm 2","Uwe","Wernecke","MGC Bad Oldesloe e.V.","","","","","",""]
[36311,"H","Lars","Werner","MGC Freizeitzentrum Biebertal","","","","","",""]
[37386,"D","Simone","Werner","MGC Murnau am Staffelsee e.V.","","","","","",""]
[31120,"Sm 1","Hans Jürgen","Werner","MSC Bensheim-Auerbach e.V.","","","","","",""]
[35666,"D","Jana","Wernicke","BGC Neutraubling e.V.","","","","","",""]
[28786,"Sm 1","Karlheinz","Werres","1.KGC Mönchengladbach e.V.","","","","","",""]
[35546,"H","Florian","Wesemann","BGC Diepholz","Ja","13646","","","","X"]
[36292,"H","Eike-Fabian","Wesemann","BGC Diepholz","Ja","","","","",""]
[50388,"H","Christoph","Wess","MGC putter Künzell 1970 e.V.","","","","","",""]
[43598,"Sm 1","Volker","Wesselmäcking","TSV Salzgitter","Ja","","","","",""]
[37466,"Sm 2","Klaus","Wessendorf","MC Georgsmarienhütte e.V.","","","","","",""]
[66199,"Sm 2","Stefan","Westerfeld","VfB Osnabrück e.V.","","","","","",""]
[34970,"Sm 1","Lars","Westermann","1. Porzer MGC Grün-Weiß 1969 e.V.","","","","","",""]
[67407,"D","Stefanie","Westerwelle","BV Sennestadt","","","","","",""]
[2238,"Sw 1","Karin","Westrup","MGC Lippe-Detmold e.V.","","","","","",""]
[66696,"Sm 1","Rainer","Wettstädt","MV Lankwitzer Dragons","","","","","",""]
[37659,"Jm","Jonas","Wetzel","BGC Dormagen e.V.","","","","","",""]
[31721,"Sm 1","Klaus","Wetzel","BGC Dormagen e.V.","","","","","",""]
[42610,"Sm 1","Markus","Wetzel","BGC Dormagen e.V.","","","","","",""]
[31216,"Sw 1","Cornelia","Wetzel","1. CGC Blau-Gelb Grötzingen","","","","","",""]
[44673,"Sw 1","Heike","Wetzel","BGC Dormagen e.V.","","","","","",""]
[5581,"Sm 2","Paul","Wetzel","1. MGC Süßen e.V.","","","","","",""]
[3309,"Sm 2","Christian","Weyandt","SSV Ulm 1846 Abt. Bahnengolf","","","","","",""]
[46965,"Sm 1","Stefan","Weyers","BGC Uerdingen e.V.","","","","","",""]
[29149,"Sm 1","Frank","Weygold","1. MGC Ladenburg e.V.","","","","","",""]
[27809,"Sm 1","Thomas","Weygoldt","1. MGC Ladenburg e.V.","","","","","",""]
[45696,"Sm 1","Andreas","Wiards","KSV Baltrum e.V.","","","","","",""]
[43497,"Sm 1","Marcus","Wiche","MSC Bad Godesberg e.V.","","","","","",""]
[3808,"Sm 2","Peter","Wichmann","Niendorfer MC","","","","","",""]
[3219,"Sw 2","Christa","Wichmann","Niendorfer MC","","","","","",""]
[38324,"H","Daniel","Wick","MGC Traben-Trarbach","","","","","",""]
[33820,"Sm 1","Stefan","Wicke","MGC Lohfelden","Ja","11926","","X","",""]
[30278,"Sm 2","Frank","Wickel","MGC Heven e.V.","","","","","",""]
[33510,"D","Melanie","Wickel-Paffrath","MGC Heven e.V.","","","","","",""]
[41894,"Sm 1","Bernd","Widera","BGC Wolfsburg","Ja","","","","",""]
[47446,"H","Roland","Widmair","MGC Bad Feilnbach e.V.","","","","","",""]
[30082,"Sm 2","Peter","Widmair","MGC Bad Feilnbach e.V.","","","","","",""]
[37722,"Sm 2","Peter","Wiebauer","1. MGC Ludwigshafen e.V.","","","","","",""]
[65464,"Sw 2","Christine","Wiebauer","1. MGC Ludwigshafen e.V.","","","","","",""]
[32946,"Sm 2","Friedrich","Wiebusch","SC Wermelskirchen 1976 e.V.","","","","","",""]
[61922,"Sm 2","Herbert","Wieck","VfL Lüneburg","Ja","","","","",""]
[38379,"Sm 2","Klaus-Heinrich","Wiedemann","VfM e.V. Berlin ","","","","","",""]
[36603,"H","Oliver","Wieder","SV Gebhardshagen","Ja","","","","",""]
[50331,"Sm 2","Peter","Wiedmaier","MCE Sindelfingen e.V.","","","","","",""]
[33568,"Sm 1","Stephan","Wiedmann","SG Arheilgen Abt. Bahnengolf","","","","","",""]
[34736,"Sm 1","Dieter","Wiedmann","TV Niederstetten 1862 e.V.  Abt. Minigolf","","","","","",""]
[1002,"Sm 2","Dieter","Wiegand","BGC Hannover","Ja","","","","",""]
[48335,"H","Michael","Wiegard","MGC putter Künzell 1970 e.V.","","","","","",""]
[38058,"H","Florian","Wiegard","MGC putter Künzell 1970 e.V.","","","","","",""]
[38061,"H","Marvin","Wiegel","Bochumer Minigolf-Club 1960 e.V.","","","","","",""]
[4859,"Sm 2","Reinhold","Wiegelmann","Minigolf Wölfe Rheinstetten 02","","","","","",""]
[42659,"Sw 1","Beate","Wiemer","TSV Pfungstadt Abt. Bahnengolf e.V.","","","","","",""]
[25211,"Sm 2","Thomas","Wiemer","MSC Bensheim-Auerbach e.V.","","","","","",""]
[49980,"D","Ellen","Wienand","1. BGC Paderborn e.V.","","","","","",""]
[50367,"H","Thomas","Wiertz","MGC Bad Salzuflen e.V.","","","","","",""]
[30856,"Sm 1","Lutz","Wierum","BGV Bergisch Land 1962 / 63 e.V.","","","","","",""]
[37893,"Sm 1","René","Wieser","HMC Büttgen e.V.","","","","","",""]
[66730,"D","Nicole","Wiesinger","MGF Ottobrunn e.V.","","","","","",""]
[66667,"Jm","Julian","Wiesinger","MGF Ottobrunn e.V.","","","","","",""]
[66714,"Sm 1","Peter","Wiesinger","MGF Ottobrunn e.V.","","","","","",""]
[46031,"H","Florian","Wietz","Niendorfer MC","","","","","",""]
[67025,"Sw 1","Barbara","Wihler","2. MGC Worms","","","","","",""]
[28564,"Sm 1","Horst","Wihler jun.","2. MGC Worms","","","","","",""]
[34737,"H","Markus","Wild","TV Niederstetten 1862 e.V.  Abt. Minigolf","","","","","",""]
[24312,"Sm 2","Dieter","Wild","MGSC Wernau e.V.","","","","","",""]
[10721,"Sw 2","Annemarie","Wild","MGSC Wernau e.V.","","","","","",""]
[29310,"Sm 2","Walter","Wildt","MGF Hammer e.V.","","","","","",""]
[66453,"H","Carsten","Wilhelm","BGC Bildstock e.V.","","","","","",""]
[67132,"Schm","Nils","Wilhelm","BGC Bildstock e.V.","","","","","",""]
[4057,"Sm 2","Horst-Peter","Wilhelm","Reinickendorfer MGC e.V.","","","","","",""]
[66164,"Jw","Valerie","Wilhelms","BSC Ennepetal e.V.","","","","","",""]
[44805,"Sm 1","Ralf","Wilhelms","BSC Ennepetal e.V.","","","","","",""]
[46290,"Sw 1","Alexandra","Wilhelms","BSC Ennepetal e.V.","","","","","",""]
[28156,"Sm 1","Andreas","Wilkening","BGC Schweinfurt e.V.","","","","","",""]
[3575,"Sm 2","Hans-Peter","Wilkesmann","BGC Dormagen e.V.","","","","","",""]
[42431,"Sm 1","Jan","Wille","BGSC Bochum 1978 e.V.","","","","","",""]
[66006,"Sm 1","Michael","Willeke","MC 62 Lüdenscheid e.V.","","","","","",""]
[29879,"Sm 1","Marcus","Willems","1. BGC Wesseling 1975 e.V.","","","","","",""]
[33849,"D","Anke","Willenbockel","Minigolfclub Karlshagen e.V.","","","","","",""]
[3839,"Sm 2","Eike","Willenbockel","MC Möve Cuxhaven","Ja","","","","",""]
[29796,"Sw 2","Marion","Willenbockel","MC Möve Cuxhaven","Ja","","","","",""]
[32333,"D","Melanie","Willfroth","KSV Baltrum e.V.","","","","","",""]
[38004,"Sm 2","Lothar","Willkommen","TSV Arendsee e.V.","","","","","",""]
[37540,"H","Marco","Willnus","MGC Göttingen","Ja","","","","",""]
[46364,"D","Jacqueline","Willnus","BGC Wolfsburg","Ja","19742","","","","X"]
[66123,"Jm","Pascal","Willy","BSV 82 Ohlsbach e.V.","","","","","",""]
[37683,"D","Katrin","Wilms","CGC Grün-Gold Bad Hamm e.V.","","","","","",""]
[42963,"Sm 2","Joachim","Wilsch","HMC Büttgen e.V.","","","","","",""]
[42964,"Sw 2","Petra","Wilsch","HMC Büttgen e.V.","","","","","",""]
[37311,"H","Michael","Wimmer","MSK Olching e.V.","","","","","",""]
[33708,"Sw 1","Kirsten","Wimmer","MSC Bensheim-Auerbach e.V.","","","","","",""]
[33926,"Sm 1","Andreas","Winkel","MGSC Wernau e.V.","","","","","",""]
[36541,"Sm 1","Dirk","Winkler","BGSC \"Gut Schlag\" Gladbeck e.V.","","","","","",""]
[38201,"H","Simon Leon","Winter","MGC Wetzlar e.V.","","","","","",""]
[29261,"D","Stefanie","Winters","BGSV Kerpen e.V.","","","","","",""]
[45644,"Sm 1","Peter","Winters","BGSV Kerpen e.V.","","","","","",""]
[37763,"H","Thorsten","Winzer","MGC Freizeitzentrum Biebertal","","","","","",""]
[36520,"Sm 1","Toni","Wirbals","TSV Kücknitz Abt. Bahnengolf","","","","","",""]
[25167,"Sm 2","Michael","Wirth","1. Duisburger Minigolf Club 1962 e.V.","","","","","",""]
[32625,"H","Karsten","Wischeropp","MGF Magdeburg 1995 e.V.","","","","","",""]
[45007,"Sw 1","Birthe","Wischnath","MGC Bad Oldesloe e.V.","","","","","",""]
[67416,"Schm","Fynn","Wischott","MSK Neheim-Hüsten e.V.","","","","","",""]
[34695,"H","Marc","Wisnewski","1. MSC Wesel 6.6.1966 e.V.","","","","","",""]
[67340,"Jm","Luca Marius","Witt","Osnabrücker M.-C. von 1963 e.V.","","","","","",""]
[67055,"Sm 1","Thorsten","Witte","MGC Heringen 1997 e.V.","","","","","",""]
[1691,"Sw 1","Birgit","Witte","Tempelhofer MV Berlin e.V.","","","","","",""]
[36971,"Sm 2","Thomas","Witte","Tempelhofer MV Berlin e.V.","","","","","",""]
[41466,"Sm 1","Peter","Wittek","BGC Hannover","Ja","","","","",""]
[29626,"Sm 1","Andreas","Wittke","MGC Dormagen-Brechten e.V.","","","","","",""]
[37992,"Sw 1","Helga","Wittkopf","BGC Bremen","Ja","","","","",""]
[67230,"H","Marcel","Wittling","Osnabrücker M.-C. von 1963 e.V.","","","","","",""]
[67339,"Schw","Kiara","Wittling","Osnabrücker M.-C. von 1963 e.V.","","","","","",""]
[33415,"H","Christian","Wittwer","MSV Bad Kreuznach","","","","","",""]
[33416,"H","Daniel","Wittwer","MSV Bad Kreuznach","","","","","",""]
[37964,"Sm 1","Joachim","Wodok","BGC Bremen","Ja","","","","",""]
[35096,"Sm 2","Joachim","Wohlfarth","MSV Würzburg-Löwenbrücke e.V.","","","","","",""]
[35095,"Sw 2","Luise","Wohlfarth","MSV Würzburg-Löwenbrücke e.V.","","","","","",""]
[67362,"D","Tatjana","Wöhrmann","BSV 86 München e.V.","","","","","",""]
[67361,"Sm 1","Michael","Wöhrmann","BSV 86 München e.V.","","","","","",""]
[66234,"H","Carsten","Wolf","BGV Backumer Tal Herten e.V.","","","","","",""]
[35847,"D","Stefanie","Wolf","ASV Pegnitz, Abt. Minigolf","","","","","",""]
[66627,"D","Jessica","Wolf","BGSV Castrop e.V. 1961","","","","","",""]
[4639,"Sm 2","Henning","Wolf","BGC Northeim","Ja","4208","","","","X"]
[4835,"Sm 2","Karl-Heinz","Wolf","SC Bastion Rot Weiß Lippstadt e.V.","","","","","",""]
[66409,"Sm 2","Arnold","Wolf","SC Bastion Rot Weiß Lippstadt e.V.","","","","","",""]
[3951,"Sw 2","Renate","Wolf","BGC Northeim","Ja","","","","",""]
[40341,"H","Julian","Wolff","MC 62 Lüdenscheid e.V.","","","","","",""]
[66059,"H","Marko","Wolff","BGC Uerdingen e.V.","","","","","",""]
[548,"Sw 1","Beate","Wolff","BSV 82 Ohlsbach e.V.","","","","","",""]
[20690,"Sm 2","Bertram","Wolff","BSV 82 Ohlsbach e.V.","","","","","",""]
[66527,"Sm 2","Ulf-Michael","Wolff","BGC Hannover","Ja","28616","X","","","X"]
[4096,"Sm 2","Hermann","Wolff","MC 62 Lüdenscheid e.V.","","","","","",""]
[51529,"Sm 2","Michael","Wollenweber","MTV Seesen","Ja","21780","","X","","X"]
[66940,"H","Stefan","Woller","1. MGC Gelsenkirchen e.V.","","","","","",""]
[37471,"H","Maximilian","Wolper","BGV Backumer Tal Herten e.V.","","","","","",""]
[37084,"Sm 1","Dirk","Wolter","MGC Wuppertal-Ronsdorf 1967 e.V.","","","","","",""]
[33461,"Sm 2","Fritz-Herbert","Woltmann","MGV Bremen","Ja","","","","",""]
[839,"Sw 2","Inge","Woltmann","MGV Bremen","Ja","","","","",""]
[37276,"Sm 1","Martin","Wolyniak","SV 1890 e.V. Dreieichenhain, Abt. Bahnengolf","","","","","",""]
[66515,"Sm 1","Hajo","Wonka","TSV Pfungstadt Abt. Bahnengolf e.V.","","","","","",""]
[38503,"D","Sonja","Wontroba","MSC Bad Godesberg e.V.","","","","","",""]
[20394,"Sm 2","Frank-Thomas","Wortmann","CGC Grün-Gold Bad Hamm e.V.","","","","","",""]
[18282,"Sm 2","Ulrich","Wörz","1. MGC Metzingen e.V.","","","","","",""]
[547,"Sm 1","Jörg","Wössner","BGSV Kerpen e.V.","","","","","",""]
[66210,"Sm 2","Wolfgang","Wotzlawek","1. BGC Landshut e.V.","","","","","",""]
[66919,"Sw 1","Susanne","Wriedt","MC Flora Elmshorn e.V.","","","","","",""]
[10260,"Sm 2","Hans","Wriedt","MC Flora Elmshorn e.V.","","","","","",""]
[66408,"Sm 1","Wolfgang","Wruck","SC Bastion Rot Weiß Lippstadt e.V.","","","","","",""]
[67036,"Sm 2","Dirk","Wulhorst","BGC Hannover","Ja","","","","",""]
[33821,"D","Gaby","Wunderlich","1. MGSV Netphen e.V.","","","","","",""]
[43556,"Sm 1","Mario","Wunderlich","SV Lurup Abt. Bahnengolf","","","","","",""]
[38072,"Sm 2","Günter","Wunderlich","1. MGSV Netphen e.V.","","","","","",""]
[66541,"Sm 1","Sascha Markus","Würges","BGC Kiel West e.V.","","","","","",""]
[38504,"D","Michelle","Würthle","BSV 82 Ohlsbach e.V.","","","","","",""]
[65922,"Jm","Jan","Würthle","BSV 82 Ohlsbach e.V.","","","","","",""]
[44527,"Sm 1","Jürgen","Würthle","BSV 82 Ohlsbach e.V.","","","","","",""]
[28259,"Sm 1","Christian","Wustrack","MC Möve Cuxhaven","Ja","","","","",""]
[63375,"Sw 2","Elke","Wuttke","BGC Hannover","Ja","","","","",""]
[34420,"Sw 1","Angelika","Wycisk","BGC Leipzig","","","","","",""]
[66187,"H","Sergen","Yildiz","MGC Peine","Ja","28130","X","","",""]
[50593,"Sw 1","Bettina","Zabel","BGC Hannover","Ja","21544","","X","",""]
[45917,"H","Jürgen","Zahner","KGC Bad Urach e.V.","","","","","",""]
[41670,"Sm 1","Michael","Zahner","KGC Bad Urach e.V.","","","","","",""]
[4495,"Sm 2","Klaus","Zamponi","1. MGSV Netphen e.V.","","","","","",""]
[30058,"Sm 2","Hilmer","Zander","SG  Weiterstadt 1886 e.V.","","","","","",""]
[37272,"H","Michel","Zazzi","1. Essener CGC \"Blau-Gold\" e.V.","","","","","",""]
[35402,"Sm 1","Thorsten","Zazzi","1. Essener CGC \"Blau-Gold\" e.V.","","","","","",""]
[38261,"Sm 2","Johann","Zech","1. Bahnengolf-Club Singen e.V.","","","","","",""]
[45973,"H","Michael","Zehe","MGC Ostheim / Rhön e.V.","","","","","",""]
[60359,"Sw 2","Emma","Zehtner","BSV 86 München e.V.","","","","","",""]
[4438,"Sm 2","Werner","Zeisler","SSC Halver e.V.","","","","","",""]
[47089,"Sm 2","Klaus","Zeisler","SSC Halver e.V.","","","","","",""]
[40499,"Sm 1","Bernd","Zeller","MSK Olching e.V.","","","","","",""]
[3569,"Sm 2","Gerd","Zeller","MSK Olching e.V.","","","","","",""]
[5676,"Sw 2","Edeltraud","Zeller","MSK Olching e.V.","","","","","",""]
[47417,"Sw 2","Monika","Zeller","1. MGC München-Feldmoching e.V.","","","","","",""]
[46752,"H","Markus","Zender","MGC Bad Bodendorf e.V.","","","","","",""]
[31736,"Sm 2","Helmut","Zender","MGC Bergisch Gladbach Gierath e.V.","","","","","",""]
[18151,"Sm 2","Heinz","Zideller","BGSC Bochum 1978 e.V.","","","","","",""]
[6175,"Sm 2","Klaus","Ziebell","Tempelhofer MV Berlin e.V.","","","","","",""]
[36994,"H","Frank","Ziegler","TG Höchberg von 1862 Bahnengolf e.V.","","","","","",""]
[38485,"H","Thomas","Ziegler","BGC Schloß Paffendorf e.V.","","","","","",""]
[66330,"Sm 1","Andreas","Ziegler","MSK Olching e.V.","","","","","",""]
[66643,"Sm 1","Uwe","Ziegler","MGC \"Stahlquelle\" Bad Bocklet","","","","","",""]
[36995,"Sm 2","Roland","Ziegler","MGV Ansbach e.V.","","","","","",""]
[38205,"H","Christian","Zielaff","1. MSC Wesel 6.6.1966 e.V.","","","","","",""]
[33643,"Sm 1","Robert","Zierl","MGC Wertheim 91 e.V.","","","","","",""]
[35462,"Sw 2","Sabine","Zierl","MGC Wertheim 91 e.V.","","","","","",""]
[38515,"Sm 1","René","Ziesing","MSV Berliner Bär e.V.","","","","","",""]
[36344,"H","Lukas","Zimmermann","BGC Heilbronn e.V.","","","","","",""]
[67335,"Jm","Malte","Zimmermann","MSV Bad Kreuznach","","","","","",""]
[67398,"Jw","Clara","Zimmermann","MSV Bad Kreuznach","","","","","",""]
[67333,"Schm","Lowis","Zimmermann","MSV Bad Kreuznach","","","","","",""]
[67334,"Schm","Iven","Zimmermann","MSV Bad Kreuznach","","","","","",""]
[67332,"Sm 1","Torsten","Zimmermann","MSV Bad Kreuznach","","","","","",""]
[66463,"Sm 1","Dieter","Zimmermann","1. BGC Paderborn e.V.","","","","","",""]
[36086,"H","Christopher","Zink","BGC Northeim","Ja","","","","",""]
[45833,"Sm 2","Gerhard","Zipfel","BGC Illertissen e.V.","","","","","",""]
[35900,"D","Bianca","Zirkenbach","MGC Bad Homburg vdH e.V.","","","","","",""]
[65132,"Schw","Lavinia","Zirkenbach","MGC Bad Homburg vdH e.V.","","","","","",""]
[50153,"D","Bianca","Zodrow-Wenke","MGC Göttingen","Ja","","","","",""]
[3510,"Sw 2","Sieglinde","Zollinger","MGF Hilzingen 80 e.V.","","","","","",""]
[32674,"H","Lars","Zornstein","KSV Baltrum e.V.","","","","","",""]
[36168,"D","Nicole","Zornstein","KSV Baltrum e.V.","","","","","",""]
[36914,"Sm 2","Ronald","Zoschke","MGF Magdeburg 1995 e.V.","","","","","",""]
[37750,"D","Ruth Friederike","Zschäpe","VfB Osnabrück e.V.","","","","","",""]
[38006,"D","Hannah","Zschäpe","VfB Osnabrück e.V.","","","","","",""]
[37751,"Sm 2","Jens-Bob","Zschäpe","VfB Osnabrück e.V.","","","","","",""]
[25152,"Sm 1","Jörg","Zseby","MGV Spandau","","","","","",""]
[27316,"Sm 2","Hans-Ulrich","Zünkler","SC Bastion Rot Weiß Lippstadt e.V.","","","","","",""]
[37389,"D","Michaela","Zwirlein","MGC Murnau am Staffelsee e.V.","","","","","",""]
[37390,"Sm 1","Rainer","Zwirlein","MGC Murnau am Staffelsee e.V.","","","","","",""]
[67051,"Sm 2","Johann","Zymelka","BGC Bildstock e.V.","","","","","",""]