{"text_format":"1","workbook":"xlsx","n_sheets":8,"sheets":["Deckblatt","Turnierprotokoll","Einzelwertung","Kategoriewertung","Mannschaften","Startliste","Konstanten","players"],"not_rendered":{"charts":0,"images":1,"macros":1,"external_links":0,"defined_names":26,"comments":0,"pivot_tables":0},"unopened":[],"bounds":{"document_bytes":16777216,"sheet_cells":100000,"rows_first":2000,"rows_last":500,"rows_between":2000,"halvings":0,"cell_chars":16384,"cell_head_chars":4096},"cells_cut":0,"cells_raw":0,"read":"whole","date_system":"1900"}

{"sheet":"Deckblatt","index":0,"n_rows":69,"n_cols":16,"rows_kept":69,"cut":false,"hidden":false,"merged":[[55,5,55,10],[56,5,56,10],[55,2,55,4],[56,2,56,4],[52,0,52,1],[55,0,55,1],[56,0,56,1],[57,0,57,1],[58,0,58,1],[44,0,44,1],[45,0,45,1],[46,0,46,1],[47,0,47,1],[50,0,50,1],[0,0,0,13],[1,0,1,13],[2,0,2,13],[3,0,3,13],[5,3,5,5],[5,6,5,9],[5,12,5,13],[5,10,5,11],[4,10,4,11],[4,12,4,13],[7,3,7,5],[7,6,7,9],[7,12,7,13],[8,3,8,5],[8,6,8,9],[8,12,8,13],[7,10,7,11],[8,10,8,11],[9,3,9,5],[9,6,9,9],[9,12,9,13],[12,0,12,13],[13,0,13,13],[9,10,9,11],[47,5,47,10],[43,5,43,10],[44,2,44,4],[44,5,44,10],[45,2,45,4],[45,5,45,10],[7,15,7,17],[67,0,67,3],[50,2,50,4],[50,5,50,10],[51,5,51,10],[52,2,52,4],[52,5,52,10],[49,5,49,10],[64,0,64,3],[46,2,46,4],[46,5,46,10],[47,2,47,4]]}
[{"$f":"IF(Ligawahl<10,\"Minigolfsport-Verband Bremen/Niedersachsen e.V.\",\"Deutscher Minigolfsport Verband e. V.\")","v":"Minigolfsport-Verband Bremen/Niedersachsen e.V."}]
["Ergebnisliste"]
[{"$f":"Spieltagwahl&\". Spieltag  -  \"&VLOOKUP(Ligawahl,Teamgröße,2,0)&\"  -  Saison 2019\"","v":"3. Spieltag  -  Landesliga Nord  -  Saison 2019"}]
[{"$f":"\"am \"&TEXT(P7,\"TT.MM.JJJJ\")&\" in \"&P8","v":"am 05.05.2019 in Cuxhaven"}]
[null,null,null,"Name, Vorname",null,null,"Verein",null,null,null,"Spieler-Nr.",null,"Lizenz-Nr."]
["A. Turnierleitung:",null,null,{"$f":"IF(K6=\"\",\"\",IF(ISERROR(VLOOKUP(K6,Spieler,4,0)),\"Falsche Nummer!\",VLOOKUP(K6,Spieler,4,0)&\", \"&VLOOKUP(K6,Spieler,3,0)))","v":"Reinicke, Frank"},null,null,{"$f":"IF(ISERROR(VLOOKUP(K6,Spieler,5,0)),\"\",VLOOKUP(K6,Spieler,5,0))","v":"MC Möve Cuxhaven"},null,null,null,42691,null,{"$f":"IF(ISERROR(VLOOKUP(K6,Spieler,7,0)),\"\",VLOOKUP(K6,Spieler,7,0))","v":"17597"}]
[null,null,null,null,null,null,null,null,null,null,null,null,null,null,"Datum:","2019-05-05"]
["B. Schiedsgericht:",null,"OSR:",{"$f":"IF(K8=\"\",\"\",IF(ISERROR(VLOOKUP(K8,Spieler,4,0)),\"Falsche Nummer!\",VLOOKUP(K8,Spieler,4,0)&\", \"&VLOOKUP(K8,Spieler,3,0)))","v":"Krause, Dirk"},null,null,{"$f":"IF(ISERROR(VLOOKUP(K8,Spieler,5,0)),\"\",VLOOKUP(K8,Spieler,5,0))","v":"BGC Celle"},null,null,null,48931,null,{"$f":"IF(ISERROR(VLOOKUP(K8,Spieler,7,0)),\"\",VLOOKUP(K8,Spieler,7,0))","v":"20839"},null,"Ort:","Cuxhaven"]
[null,null,"SR:",{"$f":"IF(K9=\"\",\"\",IF(ISERROR(VLOOKUP(K9,Spieler,4,0)),\"Falsche Nummer!\",VLOOKUP(K9,Spieler,4,0)&\", \"&VLOOKUP(K9,Spieler,3,0)))","v":"Hunte, Stefanie"},null,null,{"$f":"IF(ISERROR(VLOOKUP(K9,Spieler,5,0)),\"\",VLOOKUP(K9,Spieler,5,0))","v":"BGC Diepholz"},null,null,null,40603,null,{"$f":"IF(ISERROR(VLOOKUP(K9,Spieler,7,0)),\"\",VLOOKUP(K9,Spieler,7,0))","v":"16468"},null,"System:","Miniaturgolf"]
[null,null,"SR:",{"$f":"IF(K10=\"\",\"\",IF(ISERROR(VLOOKUP(K10,Spieler,4,0)),\"Falsche Nummer!\",VLOOKUP(K10,Spieler,4,0)&\", \"&VLOOKUP(K10,Spieler,3,0)))","v":"Weigang, Klaus-Dieter"},null,null,{"$f":"IF(ISERROR(VLOOKUP(K10,Spieler,5,0)),\"\",VLOOKUP(K10,Spieler,5,0))","v":"BGC Hannover"},null,null,null,6605,null,{"$f":"IF(ISERROR(VLOOKUP(K10,Spieler,7,0)),\"\",VLOOKUP(K10,Spieler,7,0))","v":"5025"}]
{"$rows_left_out":60}
{"sheet":"Turnierprotokoll","index":1,"n_rows":27,"n_cols":7,"rows_kept":27,"cut":false,"hidden":false,"merged":[[20,0,20,2],[20,4,20,6],[22,0,22,6],[24,1,24,5],[26,4,26,6],[18,0,18,2],[18,4,18,6],[1,0,1,6],[3,1,3,6],[4,1,4,6],[5,3,5,6],[6,1,6,6],[9,1,9,4],[11,1,11,4],[12,1,12,4],[13,1,13,4],[16,0,16,2],[16,4,16,6]]}
[]
["Turnierprotokoll"]
[]
["Turnier:",{"$f":"Deckblatt!A3","v":"3. Spieltag  -  Landesliga Nord  -  Saison 2019"}]
["Veranstalter:",{"$f":"Deckblatt!A1","v":"Minigolfsport-Verband Bremen/Niedersachsen e.V."}]
["Datum:",{"$f":"Deckblatt!P7","v":"2019-05-05"},"Ort:",{"$f":"Deckblatt!P8","v":"Cuxhaven"}]
["System(e):",{"$f":"Deckblatt!P9","v":"Miniaturgolf"}]
[]
[null,"Name, Vorname",null,null,null,"Verein","Lizenz-Nr."]
["Turnierleiter:",{"$f":"IF(Deckblatt!D6=0,\"\",Deckblatt!D6)","v":"Reinicke, Frank"},null,null,null,{"$f":"IF(Deckblatt!G6=0,\"\",Deckblatt!G6)","v":"MC Möve Cuxhaven"},{"$f":"IF(Deckblatt!M6=0,\"\",Deckblatt!M6)","v":"17597"}]
{"$rows_left_out":18}
{"sheet":"Einzelwertung","index":2,"n_rows":59,"n_cols":14,"rows_kept":59,"cut":false,"hidden":false,"merged":[]}
[]
["I. Einzelwertung"]
["Pl.","Nachname","Vorname","Verein","Sp.Nr.","Kat.","R1","R2","R3","R4","Ges.","ø","Diff."]
[1,{"$f":"IF(E4=\"\",\"\",IF(ISERROR(VLOOKUP(E4,Spieler,4,0)),\"Falsche Nummer!\",VLOOKUP(E4,Spieler,4,0)))","v":"Außerwinkler"},{"$f":"IF(ISERROR(VLOOKUP(E4,Spieler,3,0)),\"\",VLOOKUP(E4,Spieler,3,0))","v":"Manfred"},{"$f":"IF(ISERROR(VLOOKUP(E4,Spieler,5,0)),\"\",VLOOKUP(E4,Spieler,5,0))","v":"BGC Hannover"},32897,{"$f":"IF(ISERROR(VLOOKUP(E4,Spieler,2,0)),\"\",VLOOKUP(E4,Spieler,2,0))","v":"Sm 2"},25,24,25,22,{"$f":"IF(COUNT(G4:J4)>0,SUM(G4:J4),\"\")","v":96},{"$f":"IF(K4<>\"\",K4/COUNT(G4:J4),\"\")","v":24},{"$f":"IF(COUNT(G4:J4)>1,LARGE(G4:J4,1)-SMALL(G4:J4,1),\"\")","v":3},{"$f":"IF(F4<>\"\",VLOOKUP(F4,Kategorieliste,2,0),\"\")","v":6}]
[{"$f":"IF(B5<>\"\",A4+1,\"\")","v":2},{"$f":"IF(E5=\"\",\"\",IF(ISERROR(VLOOKUP(E5,Spieler,4,0)),\"Falsche Nummer!\",VLOOKUP(E5,Spieler,4,0)))","v":"Rotermund"},{"$f":"IF(ISERROR(VLOOKUP(E5,Spieler,3,0)),\"\",VLOOKUP(E5,Spieler,3,0))","v":"Marie Sophie"},{"$f":"IF(ISERROR(VLOOKUP(E5,Spieler,5,0)),\"\",VLOOKUP(E5,Spieler,5,0))","v":"BGC Celle"},66952,{"$f":"IF(ISERROR(VLOOKUP(E5,Spieler,2,0)),\"\",VLOOKUP(E5,Spieler,2,0))","v":"Jw"},28,22,22,25,{"$f":"IF(COUNT(G5:J5)>0,SUM(G5:J5),\"\")","v":97},{"$f":"IF(K5<>\"\",K5/COUNT(G5:J5),\"\")","v":24.25},{"$f":"IF(COUNT(G5:J5)>1,LARGE(G5:J5,1)-SMALL(G5:J5,1),\"\")","v":6},{"$f":"IF(F5<>\"\",VLOOKUP(F5,Kategorieliste,2,0),\"\")","v":7}]
[{"$f":"IF(B6<>\"\",A5+1,\"\")","v":3},{"$f":"IF(E6=\"\",\"\",IF(ISERROR(VLOOKUP(E6,Spieler,4,0)),\"Falsche Nummer!\",VLOOKUP(E6,Spieler,4,0)))","v":"Neumann"},{"$f":"IF(ISERROR(VLOOKUP(E6,Spieler,3,0)),\"\",VLOOKUP(E6,Spieler,3,0))","v":"Kevin "},{"$f":"IF(ISERROR(VLOOKUP(E6,Spieler,5,0)),\"\",VLOOKUP(E6,Spieler,5,0))","v":"BGC Celle"},38363,{"$f":"IF(ISERROR(VLOOKUP(E6,Spieler,2,0)),\"\",VLOOKUP(E6,Spieler,2,0))","v":"H"},25,21,24,27,{"$f":"IF(COUNT(G6:J6)>0,SUM(G6:J6),\"\")","v":97},{"$f":"IF(K6<>\"\",K6/COUNT(G6:J6),\"\")","v":24.25},{"$f":"IF(COUNT(G6:J6)>1,LARGE(G6:J6,1)-SMALL(G6:J6,1),\"\")","v":6},{"$f":"IF(F6<>\"\",VLOOKUP(F6,Kategorieliste,2,0),\"\")","v":2}]
[4,{"$f":"IF(E7=\"\",\"\",IF(ISERROR(VLOOKUP(E7,Spieler,4,0)),\"Falsche Nummer!\",VLOOKUP(E7,Spieler,4,0)))","v":"Michna"},{"$f":"IF(ISERROR(VLOOKUP(E7,Spieler,3,0)),\"\",VLOOKUP(E7,Spieler,3,0))","v":"Wolfgang"},{"$f":"IF(ISERROR(VLOOKUP(E7,Spieler,5,0)),\"\",VLOOKUP(E7,Spieler,5,0))","v":"MC Möve Cuxhaven"},33336,{"$f":"IF(ISERROR(VLOOKUP(E7,Spieler,2,0)),\"\",VLOOKUP(E7,Spieler,2,0))","v":"Sm 2"},23,27,23,25,{"$f":"IF(COUNT(G7:J7)>0,SUM(G7:J7),\"\")","v":98},{"$f":"IF(K7<>\"\",K7/COUNT(G7:J7),\"\")","v":24.5},{"$f":"IF(COUNT(G7:J7)>1,LARGE(G7:J7,1)-SMALL(G7:J7,1),\"\")","v":4},{"$f":"IF(F7<>\"\",VLOOKUP(F7,Kategorieliste,2,0),\"\")","v":6}]
[5,{"$f":"IF(E8=\"\",\"\",IF(ISERROR(VLOOKUP(E8,Spieler,4,0)),\"Falsche Nummer!\",VLOOKUP(E8,Spieler,4,0)))","v":"Ehm"},{"$f":"IF(ISERROR(VLOOKUP(E8,Spieler,3,0)),\"\",VLOOKUP(E8,Spieler,3,0))","v":"Marion"},{"$f":"IF(ISERROR(VLOOKUP(E8,Spieler,5,0)),\"\",VLOOKUP(E8,Spieler,5,0))","v":"BGC Celle"},46898,{"$f":"IF(ISERROR(VLOOKUP(E8,Spieler,2,0)),\"\",VLOOKUP(E8,Spieler,2,0))","v":"Sw 1"},25,25,27,23,{"$f":"IF(COUNT(G8:J8)>0,SUM(G8:J8),\"\")","v":100},{"$f":"IF(K8<>\"\",K8/COUNT(G8:J8),\"\")","v":25},{"$f":"IF(COUNT(G8:J8)>1,LARGE(G8:J8,1)-SMALL(G8:J8,1),\"\")","v":4},{"$f":"IF(F8<>\"\",VLOOKUP(F8,Kategorieliste,2,0),\"\")","v":3}]
[6,{"$f":"IF(E9=\"\",\"\",IF(ISERROR(VLOOKUP(E9,Spieler,4,0)),\"Falsche Nummer!\",VLOOKUP(E9,Spieler,4,0)))","v":"Weigang"},{"$f":"IF(ISERROR(VLOOKUP(E9,Spieler,3,0)),\"\",VLOOKUP(E9,Spieler,3,0))","v":"Barbara"},{"$f":"IF(ISERROR(VLOOKUP(E9,Spieler,5,0)),\"\",VLOOKUP(E9,Spieler,5,0))","v":"BGC Hannover"},46277,{"$f":"IF(ISERROR(VLOOKUP(E9,Spieler,2,0)),\"\",VLOOKUP(E9,Spieler,2,0))","v":"Sw 2"},25,24,26,26,{"$f":"IF(COUNT(G9:J9)>0,SUM(G9:J9),\"\")","v":101},{"$f":"IF(K9<>\"\",K9/COUNT(G9:J9),\"\")","v":25.25},{"$f":"IF(COUNT(G9:J9)>1,LARGE(G9:J9,1)-SMALL(G9:J9,1),\"\")","v":2},{"$f":"IF(F9<>\"\",VLOOKUP(F9,Kategorieliste,2,0),\"\")","v":5}]
[7,{"$f":"IF(E10=\"\",\"\",IF(ISERROR(VLOOKUP(E10,Spieler,4,0)),\"Falsche Nummer!\",VLOOKUP(E10,Spieler,4,0)))","v":"Jahrmärker"},{"$f":"IF(ISERROR(VLOOKUP(E10,Spieler,3,0)),\"\",VLOOKUP(E10,Spieler,3,0))","v":"Uta"},{"$f":"IF(ISERROR(VLOOKUP(E10,Spieler,5,0)),\"\",VLOOKUP(E10,Spieler,5,0))","v":"BGC Celle"},44499,{"$f":"IF(ISERROR(VLOOKUP(E10,Spieler,2,0)),\"\",VLOOKUP(E10,Spieler,2,0))","v":"Sw 2"},25,24,28,24,{"$f":"IF(COUNT(G10:J10)>0,SUM(G10:J10),\"\")","v":101},{"$f":"IF(K10<>\"\",K10/COUNT(G10:J10),\"\")","v":25.25},{"$f":"IF(COUNT(G10:J10)>1,LARGE(G10:J10,1)-SMALL(G10:J10,1),\"\")","v":4},{"$f":"IF(F10<>\"\",VLOOKUP(F10,Kategorieliste,2,0),\"\")","v":5}]
{"$rows_left_out":50}
{"sheet":"Kategoriewertung","index":3,"n_rows":3,"n_cols":13,"rows_kept":3,"cut":false,"hidden":true,"merged":[]}
[]
["I. Einzelwertung nach Kategorien"]
["Pl.","Nachname","Vorname","Verein","Sp.Nr.","Kat.","R1","R2","R3","R4","Ges.","ø","Diff."]

{"sheet":"Mannschaften","index":4,"n_rows":52,"n_cols":16,"rows_kept":52,"cut":false,"hidden":false,"merged":[[21,1,21,4],[23,4,23,5],[23,9,23,10],[31,1,31,4],[41,1,41,4],[43,4,43,5],[43,9,43,10],[51,1,51,4],[13,4,13,5],[13,9,13,10],[11,1,11,4],[3,4,3,5],[3,9,3,10],[33,4,33,5],[33,9,33,10]]}
["J. Mannschaftswertung:"]
[]
[]
[1,"1. BGC Celle I",null,null,null,null,null,null,"Schnitt:",{"$f":"IF(COUNTIF(INDIRECT(\"G\"&ROW()+2&\":J\"&ROW()+AnzSp+1),\">0\")>0,K12/(COUNTIF(INDIRECT(\"G\"&ROW()+2&\":J\"&ROW()+AnzSp+1),\">0\")-COUNTIF(INDIRECT(\"L\"&ROW()+2&\":O\"&ROW()+AnzSp+1),\"X\")),0)","v":24.25}]
["Nr.:","Nachname","Vorname",null,"Sp.Nr.","Kat.","R1","R2","R3","R4","Wertung",null,null,null,null,"Gesamt"]
[1,{"$f":"IF(E6=\"\",\"\",IF(ISERROR(VLOOKUP(E6,Spieler,4,0)),\"Falsche Nummer!\",VLOOKUP(E6,Spieler,4,0)))","v":"Krause"},{"$f":"IF(ISERROR(VLOOKUP(E6,Spieler,3,0)),\"\",VLOOKUP(E6,Spieler,3,0))","v":"Dirk"},null,48931,{"$f":"IF(ISERROR(VLOOKUP(E6,Spieler,2,0)),\"\",VLOOKUP(E6,Spieler,2,0))","v":"Sm 1"},{"$f":"IF(ISERROR(VLOOKUP($E6,Ergebnisse,COLUMN()-4,0)),0,VLOOKUP($E6,Ergebnisse,COLUMN()-4,0))","v":30},31,22,24,{"$f":"IF(L6=\"X\",0,G6)+IF(M6=\"X\",0,H6)+IF(N6=\"X\",0,I6)+IF(O6=\"X\",0,J6)","v":46},{"$f":"IF(G6>0,IF(AND(COUNTIF(INDIRECT(\"Z\"&(ROW()+1-$A6&\"S\"&COLUMN()-5)&\":Z\"&(ROW()+AnzSp-$A6)&\"S\"&COLUMN()-5,0),\">0\")=AnzSp-1,G6=LARGE(INDIRECT(\"Z\"&(ROW()+1-$A6&\"S\"&COLUMN()-5)&\":Z\"&(ROW()+AnzSp-$A6)&\"S\"&COLUMN()-5,0),1),COUNTIF(INDIRECT(\"Z\"&(ROW()+1-$A6&\"S\"&COLUMN()-5)&\":Z\"&(ROW())&\"S\"&COLUMN()-5,0),G6)=1),\"X\",IF(AND(COUNTIF(INDIRECT(\"Z\"&(ROW()+1-$A6&\"S\"&COLUMN()-5)&\":Z\"&(ROW()+AnzSp-$A6)&\"S\"&COLUMN()-5,0),\">0\")=AnzSp,INDIRECT(\"Z\"&(ROW()+AnzSp+1-$A6)&\"S6\",0)>0,G6=LARGE(INDIRECT(\"Z\"&(ROW()+1-$A6&\"S\"&COLUMN()-5)&\":Z\"&(ROW()+AnzSp-$A6)&\"S\"&COLUMN()-5,0),1),COUNTIF(INDIRECT(\"Z\"&(ROW()+1-$A6&\"S\"&COLUMN()-5)&\":Z\"&(ROW())&\"S\"&COLUMN()-5,0),G6)<3),\"X\",IF(AND(COUNTIF(INDIRECT(\"Z\"&(ROW()+1-$A6&\"S\"&COLUMN()-5)&\":Z\"&(ROW()+AnzSp-$A6)&\"S\"&COLUMN()-5,0),\">0\")=AnzSp,INDIRECT(\"Z\"&(ROW()+AnzSp+1-$A6)&\"S6\",0)>0,G6=LARGE(INDIRECT(\"Z\"&(ROW()+1-$A6&\"S\"&COLUMN()-5)&\":Z\"&(ROW()+AnzSp-$A6)&\"S\"&COLUMN()-5,0),2),COUNTIF(INDIRECT(\"Z\"&(ROW()+1-$A6&\"S\"&COLUMN()-5)&\":Z\"&(ROW())&\"S\"&COLUMN()-5,0),G6)=1),\"X\",\"\"))),\"\")","v":"X"},"X","","",{"$f":"SUM(G6:J6)","v":107}]
[2,"Rotermund","Marie Sophie",null,66952,"Jw",28,22,22,25,97,"","","","",{"$f":"SUM(G7:J7)","v":97}]
[3,"Neumann","Kevin ",null,38363,"H",25,21,24,27,70,"","","","X",97]
[4,"Ehm","Marion",null,46898,"Sw 1",25,25,27,23,48,"","X","X","",100]
[5,"Lindenberg","Mareike",null,40203,"D",30,24,25,25,74,"X","","","",104]
{"$rows_left_out":43}
{"sheet":"Startliste","index":5,"n_rows":34,"n_cols":4,"rows_kept":34,"cut":false,"hidden":false,"merged":[[0,0,0,3],[11,0,11,3]]}
[{"$f":"Deckblatt!A3","v":"3. Spieltag  -  Landesliga Nord  -  Saison 2019"}]
[]
[]
["Turnierleitung:",null,{"$f":"IF(Deckblatt!D6=0,\"\",Deckblatt!D6)","v":"Reinicke, Frank"},{"$f":"IF(Deckblatt!G6=0,\"\",Deckblatt!G6)","v":"MC Möve Cuxhaven"}]
[]
["Oberschiedsrichter:",null,{"$f":"IF(Deckblatt!D8=0,\"\",Deckblatt!D8)","v":"Krause, Dirk"},{"$f":"IF(Deckblatt!G8=0,\"\",Deckblatt!G8)","v":"BGC Celle"}]
["Schiedsrichter:",null,{"$f":"IF(Deckblatt!D9=0,\"\",Deckblatt!D9)","v":"Hunte, Stefanie"},{"$f":"IF(Deckblatt!G9=0,\"\",Deckblatt!G9)","v":"BGC Diepholz"}]
["Schiedsrichter:",null,{"$f":"IF(Deckblatt!D10=0,\"\",Deckblatt!D10)","v":"Weigang, Klaus-Dieter"},{"$f":"IF(Deckblatt!G10=0,\"\",Deckblatt!G10)","v":"BGC Hannover"}]
[]
[]
{"$rows_left_out":25}
{"sheet":"Konstanten","index":6,"n_rows":37,"n_cols":7,"rows_kept":37,"cut":false,"hidden":true,"merged":[]}
[]
["Kurzbezeichnung","Reihenfolge",null,"Ligennummer","Ligenbezeichnung","Anzahl Spieler","Kategoriewertung"]
["D",1,null,1,"Bezirksklasse Nord",5,"Ja"]
["H",2,null,2,"Bezirksklasse Mitte",5,"Ja"]
["Sw 1",3,null,3,"Bezirksklasse Ost",5,"Ja"]
["Sm 1",4,null,4,"Bezirksklasse Süd",5,"Ja"]
["Sw 2",5,null,5,"Bezirksliga Nord-Mitte",5,"Ja"]
["Sm 2",6,null,6,"Landesliga Nord",6,"Nein"]
["Jw",7,null,7,"Landesliga Süd",6,"Nein"]
["Jm",8,null,8,"Verbandsliga Staffel 1",7,"Nein"]
{"$rows_left_out":28}
{"sheet":"players","index":7,"n_rows":3979,"n_cols":11,"rows_kept":3979,"cut":false,"hidden":false,"merged":[]}
["SpielerNr","Kategorie","Vorname","Nachname","Kurzname","MVBN","LizenzNr","SC","SB","SA","TL"]
[25891,"Sm 2","Lothar","Abele","1. MGC Metzingen e.V.","","","","","",""]
[869,"Sw 2","Birgit","Abeling-Betzien","BGC Diepholz","Ja","","","","",""]
[33312,"Sm 2","Edgar","Abelmann","BGC Hannover","Ja","","","","",""]
[27712,"Sm 1","Thomas","Abendroth","Reinickendorfer MGC e.V.","","","","","",""]
[43272,"H","Hendrik","Ackermann","1. MGC Ludwigshafen e.V.","","","","","",""]
[34631,"H","Jan Sebastian","Adam","VfL Lüneburg","Ja","12733","X","","",""]
[67154,"D","Jessica","Adam","VfL Lüneburg","Ja","29732","X","","",""]
[36366,"Sm 2","Herbert","Adam","MGC Felderbachtal 1964 e.V.","","","","","",""]
[36901,"Sw 2","Gabriele","Adam","MGC Felderbachtal 1964 e.V.","","","","","",""]
{"$rows_left_out":3969}